PlanetJava
Custom Search

java-jenkins-user
[Top] [All Lists]

Fails on maven dependency resolution

Subject: Fails on maven dependency resolution
Date: Tue, 17 Apr 2012 04:47:29 -0700 (PDT)
Hi,
I'm trying to set up Jenkins on a complex Maven 3 project. Before
doing so, I tested a simple project like 
https://github.com/codebrickie/GWT-Java-EE-6-Integration,
which is running fine. I can download Git source, run the jenkins
build and I also connected Sonar to it.
An example of a more complex project is https://github.com/lmco/eurekastreams.
Building their master branch fails in Jenkins 1.460. Download of
sources from GitHub works, but some dependencies can't be resolved and
break compile. However, if I build this project outside of Jenkins, it
compiles, because the missing dependencies show only warnings. By the
way, I just supplied "clean install" as maven goals.
Below is the console output from Jenkins. Does anyone know how I can
make Jenkins ignore those warnings and don't break the build? Could it
be that the resolver is fooled by the fact that one maven repo server
returns a forbidden?
Started by user Administrator
Building in workspace /usr/share/tomcat7/.jenkins/jobs/ecp-lmco-public/
workspace
Checkout:workspace / /usr/share/tomcat7/.jenkins/jobs/ecp-lmco-public/
workspace - [email protected]
Using strategy: Default
Last Built Revision: Revision b90fdcf13fdd3883f311ae6d73a0477d2a32a3c5
(origin/master)
Checkout:workspace / /usr/share/tomcat7/.jenkins/jobs/ecp-lmco-public/
workspace - [email protected]
Fetching changes from 1 remote Git repository
Fetching upstream changes from 
git-9UaJU3cA/F/[email protected]:lmco/eurekastreams.git
Commencing build of Revision b90fdcf13fdd3883f311ae6d73a0477d2a32a3c5
(origin/master)
Checking out Revision b90fdcf13fdd3883f311ae6d73a0477d2a32a3c5 (origin/
master)
Parsing POMs
[workspace] $ /usr/lib/jvm/default-java/bin/java -cp /usr/share/
tomcat7/.jenkins/plugins/maven-plugin/WEB-INF/lib/maven3-
agent-1.2.jar:/opt/maven3/boot/plexus-classworlds-2.4.jar
org.jvnet.hudson.maven3.agent.Maven3Main /opt/maven3 /var/lib/tomcat7/
webapps/jenkins/WEB-INF/lib/remoting-2.13.jar /usr/share/
tomcat7/.jenkins/plugins/maven-plugin/WEB-INF/lib/maven3-
interceptor-1.2.jar 50156
<===[JENKINS REMOTING CAPACITY]===>channel started
log4j:WARN No appenders could be found for logger
(org.apache.commons.beanutils.converters.BooleanConverter).
log4j:WARN Please initialize the log4j system properly.
Executing Maven:  -B -f /usr/share/tomcat7/.jenkins/jobs/ecp-lmco-
public/workspace/pom.xml clean install
[INFO] Scanning for projects...
[INFO]
------------------------------------------------------------------------
[INFO] Reactor Build Order:
[INFO]
[INFO] Eureka Streams Parent
[INFO] Eureka Streams Server
[INFO] Eureka Streams Shared Resources
[INFO] Eureka Streams Task Queue Processor
[INFO] Eureka Streams Database Resources
[INFO] Eureka Streams Web
Projects to build: [MavenProject: org.eurekastreams:eurekastreams-
parent:2.0-SNAPSHOT @ /usr/share/tomcat7/.jenkins/jobs/ecp-lmco-public/
workspace/pom.xml, MavenProject: org.eurekastreams:eurekastreams-
server:2.0-SNAPSHOT @ /usr/share/tomcat7/.jenkins/jobs/ecp-lmco-public/
workspace/server/pom.xml, MavenProject:
org.eurekastreams:eurekastreams-sharedresources:2.0-SNAPSHOT @ /usr/
share/tomcat7/.jenkins/jobs/ecp-lmco-public/workspace/sharedresources/
pom.xml, MavenProject: org.eurekastreams:eurekastreams-
taskqueueprocessor:2.0-SNAPSHOT @ /usr/share/tomcat7/.jenkins/jobs/ecp-
lmco-public/workspace/taskqueueprocessor/pom.xml, MavenProject:
org.eurekastreams:eurekastreams-database:2.0-SNAPSHOT @ /usr/share/
tomcat7/.jenkins/jobs/ecp-lmco-public/workspace/database/pom.xml,
MavenProject: org.eurekastreams:eurekastreams-web:2.0-SNAPSHOT @ /usr/
share/tomcat7/.jenkins/jobs/ecp-lmco-public/workspace/web/pom.xml]
projectStarted org.eurekastreams:eurekastreams-parent:2.0-SNAPSHOT
[INFO]
[INFO]
------------------------------------------------------------------------
[INFO] Building Eureka Streams Parent 2.0-SNAPSHOT
[INFO]
------------------------------------------------------------------------
mojoStarted org.apache.maven.plugins:maven-clean-plugin:2.4.1(default-
clean)
[INFO]
[INFO] --- maven-clean-plugin:2.4.1:clean (default-clean) @
eurekastreams-parent ---
[INFO] Deleting /usr/share/tomcat7/.jenkins/jobs/ecp-lmco-public/
workspace/target
mojoSucceeded org.apache.maven.plugins:maven-clean-plugin:
2.4.1(default-clean)
mojoStarted org.apache.maven.plugins:maven-checkstyle-plugin:
2.4(default)
[INFO]
[INFO] --- maven-checkstyle-plugin:2.4:checkstyle (default) @
eurekastreams-parent ---
mojoSucceeded org.apache.maven.plugins:maven-checkstyle-plugin:
2.4(default)
mojoStarted org.apache.maven.plugins:maven-install-plugin:
2.3.1(default-install)
[INFO]
[INFO] --- maven-install-plugin:2.3.1:install (default-install) @
eurekastreams-parent ---
[INFO] Installing /usr/share/tomcat7/.jenkins/jobs/ecp-lmco-public/
workspace/pom.xml to /usr/share/tomcat7/.m2/repository/org/
eurekastreams/eurekastreams-parent/2.0-SNAPSHOT/eurekastreams-
parent-2.0-SNAPSHOT.pom
mojoSucceeded org.apache.maven.plugins:maven-install-plugin:
2.3.1(default-install)
projectSucceeded org.eurekastreams:eurekastreams-parent:2.0-SNAPSHOT
projectStarted org.eurekastreams:eurekastreams-server:2.0-SNAPSHOT
[INFO]
[INFO]
------------------------------------------------------------------------
[INFO] Building Eureka Streams Server 2.0-SNAPSHOT
[INFO]
------------------------------------------------------------------------
Downloading: 
http://repository.jboss.com/maven2/org/jboss/aop/jboss-aop/2.0.0-SNAPSHOT/maven-metadata.xml
[WARNING] Could not transfer metadata org.jboss.aop:jboss-aop:2.0.0-
SNAPSHOT/maven-metadata.xml from/to jboss (http://repository.jboss.com/
maven2): Access denied to:
http://repository.jboss.com/maven2/org/jboss/aop/jboss-aop/2.0.0-SNAPSHOT/maven-metadata.xml,
ReasonPhrase:Forbidden.
[WARNING] Failure to transfer org.jboss.aop:jboss-aop:2.0.0-SNAPSHOT/
maven-metadata.xml from http://repository.jboss.com/maven2 was cached
in the local repository, resolution will not be reattempted until the
update interval of jboss has elapsed or updates are forced. Original
error: Could not transfer metadata org.jboss.aop:jboss-aop:2.0.0-
SNAPSHOT/maven-metadata.xml from/to jboss (http://repository.jboss.com/
maven2): Access denied to:
http://repository.jboss.com/maven2/org/jboss/aop/jboss-aop/2.0.0-SNAPSHOT/maven-metadata.xml,
ReasonPhrase:Forbidden.
Downloading: 
http://maven.restlet.org/org/jboss/aop/jboss-aop/2.0.0-SNAPSHOT/jboss-aop-2.0.0-SNAPSHOT.pom
Downloading: 
http://www.datanucleus.org/downloads/maven2/org/jboss/aop/jboss-aop/2.0.0-SNAPSHOT/jboss-aop-2.0.0-SNAPSHOT.pom
Downloading: 
http://mirrors.ibiblio.org/pub/mirrors/maven2/org/jboss/aop/jboss-aop/2.0.0-SNAPSHOT/jboss-aop-2.0.0-SNAPSHOT.pom
Downloading:
http://gwt-maven.googlecode.com/svn/trunk/mavenrepo/org/jboss/aop/jboss-aop/2.0.0-SNAPSHOT/jboss-aop-2.0.0-SNAPSHOT.pom
Downloading: 
http://download.java.net/maven/2/org/jboss/aop/jboss-aop/2.0.0-SNAPSHOT/jboss-aop-2.0.0-SNAPSHOT.pom
Downloading: 
http://repository.jboss.com/maven2/org/jboss/aop/jboss-aop/2.0.0-SNAPSHOT/jboss-aop-2.0.0-SNAPSHOT.pom
Downloading:
https://gilead.svn.sourceforge.net/svnroot/gilead/gilead/maven-repo/org/jboss/aop/jboss-aop/2.0.0-SNAPSHOT/jboss-aop-2.0.0-SNAPSHOT.pom
Downloading:
https://hibernate4gwt.svn.sourceforge.net/svnroot/hibernate4gwt/branches/jens_meiss/maven/org/jboss/aop/jboss-aop/2.0.0-SNAPSHOT/jboss-aop-2.0.0-SNAPSHOT.pom
Downloading:
https://gilead.svn.sourceforge.net/svnroot/gilead/gilead/maven-repo/org/jboss/aop/jboss-aop/2.0.0-SNAPSHOT/jboss-aop-2.0.0-SNAPSHOT.pom
Downloading: 
http://snapshots.jboss.org/maven2/org/jboss/aop/jboss-aop/2.0.0-SNAPSHOT/jboss-aop-2.0.0-SNAPSHOT.pom
Downloading: 
http://repository.jboss.com/maven2/org/jboss/javaee/jboss-jca-api/1.5.0-SNAPSHOT/maven-metadata.xml
[WARNING] Could not transfer metadata org.jboss.javaee:jboss-jca-api:
1.5.0-SNAPSHOT/maven-metadata.xml from/to jboss (http://
repository.jboss.com/maven2): Access denied to:
http://repository.jboss.com/maven2/org/jboss/javaee/jboss-jca-api/1.5.0-SNAPSHOT/maven-metadata.xml,
ReasonPhrase:Forbidden.
[WARNING] Failure to transfer org.jboss.javaee:jboss-jca-api:1.5.0-
SNAPSHOT/maven-metadata.xml from http://repository.jboss.com/maven2
was cached in the local repository, resolution will not be reattempted
until the update interval of jboss has elapsed or updates are forced.
Original error: Could not transfer metadata org.jboss.javaee:jboss-jca-
api:1.5.0-SNAPSHOT/maven-metadata.xml from/to jboss (http://
repository.jboss.com/maven2): Access denied to:
http://repository.jboss.com/maven2/org/jboss/javaee/jboss-jca-api/1.5.0-SNAPSHOT/maven-metadata.xml,
ReasonPhrase:Forbidden.
Downloading: 
http://maven.restlet.org/org/jboss/javaee/jboss-jca-api/1.5.0-SNAPSHOT/jboss-jca-api-1.5.0-SNAPSHOT.pom
Downloading:
http://www.datanucleus.org/downloads/maven2/org/jboss/javaee/jboss-jca-api/1.5.0-SNAPSHOT/jboss-jca-api-1.5.0-SNAPSHOT.pom
Downloading:
http://mirrors.ibiblio.org/pub/mirrors/maven2/org/jboss/javaee/jboss-jca-api/1.5.0-SNAPSHOT/jboss-jca-api-1.5.0-SNAPSHOT.pom
Downloading:
http://gwt-maven.googlecode.com/svn/trunk/mavenrepo/org/jboss/javaee/jboss-jca-api/1.5.0-SNAPSHOT/jboss-jca-api-1.5.0-SNAPSHOT.pom
Downloading: 
http://download.java.net/maven/2/org/jboss/javaee/jboss-jca-api/1.5.0-SNAPSHOT/jboss-jca-api-1.5.0-SNAPSHOT.pom
Downloading: 
http://repository.jboss.com/maven2/org/jboss/javaee/jboss-jca-api/1.5.0-SNAPSHOT/jboss-jca-api-1.5.0-SNAPSHOT.pom
Downloading:
https://gilead.svn.sourceforge.net/svnroot/gilead/gilead/maven-repo/org/jboss/javaee/jboss-jca-api/1.5.0-SNAPSHOT/jboss-jca-api-1.5.0-SNAPSHOT.pom
Downloading:
https://hibernate4gwt.svn.sourceforge.net/svnroot/hibernate4gwt/branches/jens_meiss/maven/org/jboss/javaee/jboss-jca-api/1.5.0-SNAPSHOT/jboss-jca-api-1.5.0-SNAPSHOT.pom
Downloading:
https://gilead.svn.sourceforge.net/svnroot/gilead/gilead/maven-repo/org/jboss/javaee/jboss-jca-api/1.5.0-SNAPSHOT/jboss-jca-api-1.5.0-SNAPSHOT.pom
Downloading: 
http://snapshots.jboss.org/maven2/org/jboss/javaee/jboss-jca-api/1.5.0-SNAPSHOT/jboss-jca-api-1.5.0-SNAPSHOT.pom
projectFailed org.eurekastreams:eurekastreams-server:2.0-SNAPSHOT
sessionEnded
[INFO]
------------------------------------------------------------------------
[INFO] Reactor Summary:
[INFO]
[INFO] Eureka Streams Parent ............................. SUCCESS
[3.415s]
[INFO] Eureka Streams Server ............................. FAILURE
[10.135s]
[INFO] Eureka Streams Shared Resources ................... SKIPPED
[INFO] Eureka Streams Task Queue Processor ............... SKIPPED
[INFO] Eureka Streams Database Resources ................. SKIPPED
[INFO] Eureka Streams Web ................................ SKIPPED
[INFO]
------------------------------------------------------------------------
[INFO] BUILD FAILURE
[INFO]
------------------------------------------------------------------------
[INFO] Total time: 14.194s
[INFO] Finished at: Tue Apr 17 13:44:48 CEST 2012
[INFO] Final Memory: 19M/189M
[INFO]
------------------------------------------------------------------------
Projects to build: [MavenProject: org.eurekastreams:eurekastreams-
parent:2.0-SNAPSHOT @ /usr/share/tomcat7/.jenkins/jobs/ecp-lmco-public/
workspace/pom.xml, MavenProject: org.eurekastreams:eurekastreams-
server:2.0-SNAPSHOT @ /usr/share/tomcat7/.jenkins/jobs/ecp-lmco-public/
workspace/server/pom.xml, MavenProject:
org.eurekastreams:eurekastreams-sharedresources:2.0-SNAPSHOT @ /usr/
share/tomcat7/.jenkins/jobs/ecp-lmco-public/workspace/sharedresources/
pom.xml, MavenProject: org.eurekastreams:eurekastreams-
taskqueueprocessor:2.0-SNAPSHOT @ /usr/share/tomcat7/.jenkins/jobs/ecp-
lmco-public/workspace/taskqueueprocessor/pom.xml, MavenProject:
org.eurekastreams:eurekastreams-database:2.0-SNAPSHOT @ /usr/share/
tomcat7/.jenkins/jobs/ecp-lmco-public/workspace/database/pom.xml,
MavenProject: org.eurekastreams:eurekastreams-web:2.0-SNAPSHOT @ /usr/
share/tomcat7/.jenkins/jobs/ecp-lmco-public/workspace/web/pom.xml]
[JENKINS] Archiving /usr/share/tomcat7/.jenkins/jobs/ecp-lmco-public/
workspace/pom.xml to /usr/share/tomcat7/.jenkins/jobs/ecp-lmco-public/
modules/org.eurekastreams$eurekastreams-parent/builds/
2012-04-17_13-44-31/archive/org.eurekastreams/eurekastreams-parent/2.0-
SNAPSHOT/eurekastreams-parent-2.0-SNAPSHOT.pom
[JENKINS] Archiving /usr/share/tomcat7/.jenkins/jobs/ecp-lmco-public/
workspace/taskqueueprocessor/pom.xml to /usr/share/tomcat7/.jenkins/
jobs/ecp-lmco-public/modules/org.eurekastreams$eurekastreams-
taskqueueprocessor/builds/2012-04-17_13-44-31/archive/
org.eurekastreams/eurekastreams-taskqueueprocessor/2.0-SNAPSHOT/
eurekastreams-taskqueueprocessor-2.0-SNAPSHOT.pom
[JENKINS] Archiving /usr/share/tomcat7/.jenkins/jobs/ecp-lmco-public/
workspace/sharedresources/pom.xml to /usr/share/tomcat7/.jenkins/jobs/
ecp-lmco-public/modules/org.eurekastreams$eurekastreams-
sharedresources/builds/2012-04-17_13-44-31/archive/org.eurekastreams/
eurekastreams-sharedresources/2.0-SNAPSHOT/eurekastreams-
sharedresources-2.0-SNAPSHOT.pom
[JENKINS] Archiving /usr/share/tomcat7/.jenkins/jobs/ecp-lmco-public/
workspace/web/pom.xml to /usr/share/tomcat7/.jenkins/jobs/ecp-lmco-
public/modules/org.eurekastreams$eurekastreams-web/builds/
2012-04-17_13-44-31/archive/org.eurekastreams/eurekastreams-web/2.0-
SNAPSHOT/eurekastreams-web-2.0-SNAPSHOT.pom
[JENKINS] Archiving /usr/share/tomcat7/.jenkins/jobs/ecp-lmco-public/
workspace/server/pom.xml to /usr/share/tomcat7/.jenkins/jobs/ecp-lmco-
public/modules/org.eurekastreams$eurekastreams-server/builds/
2012-04-17_13-44-31/archive/org.eurekastreams/eurekastreams-server/2.0-
SNAPSHOT/eurekastreams-server-2.0-SNAPSHOT.pom
[JENKINS] Archiving /usr/share/tomcat7/.jenkins/jobs/ecp-lmco-public/
workspace/database/pom.xml to /usr/share/tomcat7/.jenkins/jobs/ecp-
lmco-public/modules/org.eurekastreams$eurekastreams-database/builds/
2012-04-17_13-44-31/archive/org.eurekastreams/eurekastreams-database/
2.0-SNAPSHOT/eurekastreams-database-2.0-SNAPSHOT.pom
Waiting for Jenkins to finish collecting data
mavenExecutionResult exceptions not empty
message : Failed to execute goal on project eurekastreams-server:
Could not resolve dependencies for project
org.eurekastreams:eurekastreams-server:jar:2.0-SNAPSHOT: Failed to
collect dependencies for [rome:rome:jar:1.0 (compile), rome:rome-
fetcher:jar:1.0 (compile), rome:modules:jar:0.3.2 (compile),
org.restlet:org.restlet:jar:1.1.10 (compile),
org.restlet:org.restlet.ext.spring:jar:1.1.10 (compile),
com.noelios.restlet:com.noelios.restlet:jar:1.1.10 (compile),
com.noelios.restlet:com.noelios.restlet.ext.jetty:jar:1.1.10
(compile), com.noelios.restlet:com.noelios.restlet.ext.servlet:jar:
1.1.10 (compile),
com.noelios.restlet:com.noelios.restlet.ext.spring:jar:1.1.10
(compile), org.jsecurity:jsecurity:jar:0.9.0 (compile),
com.ibm.icu:icu4j:jar:3.8 (compile), org.codehaus.woodstox:wstx-
asl:jar:3.2.7 (compile), org.codehaus.jackson:jackson-core-asl:jar:
1.6.0 (compile), org.codehaus.jackson:jackson-jaxrs:jar:1.6.0
(compile), org.codehaus.jackson:jackson-mapper-asl:jar:1.6.0
(compile), net.oauth.core:oauth:jar:20100527 (compile),
net.oauth.core:oauth-provider:jar:20100527 (compile),
net.oauth.core:oauth-httpclient4:jar:20090913 (compile),
org.apache.shindig:shindig-server:war:2.0.1.3 (compile),
org.apache.shindig:shindig-social-api:jar:2.0.1.3 (compile),
org.apache.shindig:shindig-common:jar:2.0.1.3 (compile),
org.apache.shindig:shindig-common:jar:tests:2.0.1.3 (test),
org.apache.shindig:shindig-gadgets:jar:2.0.1.3 (compile),
javax.mail:mail:jar:1.4.2 (compile), net.sf.json-lib:json-
lib:jar:jdk15:2.2 (compile), com.google.inject:guice:jar:2.0
(compile), com.google.inject.extensions:guice-spring:jar:2.0
(compile), com.google.inject.extensions:guice-multibindings:jar:2.0
(compile), com.google.guava:guava:jar:r06 (compile),
org.apache.velocity:velocity:jar:1.7 (compile), oro:oro:jar:2.0.8
(compile), org.apache.velocity:velocity-tools:jar:2.0 (compile),
cglib:cglib-nodep:jar:2.2 (compile), asm:asm:jar:1.5.3 (compile),
asm:asm-attrs:jar:1.5.3 (compile), junit:junit:jar:4.8.2 (test),
org.springframework:spring:jar:2.5.6.SEC02 (compile), org.jmock:jmock-
junit4:jar:2.5.1 (compile), org.jmock:jmock-legacy:jar:2.5.1 (test),
hsqldb:hsqldb:jar:1.8.0.7 (test), commons-dbcp:commons-dbcp:jar:1.2.2
(compile), log4j:log4j:jar:1.2.12 (compile), org.slf4j:slf4j-api:jar:
1.6.1 (compile), org.slf4j:slf4j-log4j12:jar:1.6.1 (compile),
org.springframework:spring-test:jar:2.5.6.SEC02 (compile),
net.sf.gilead:gilead-core:jar:1.3.2 (compile), org.dbunit:dbunit:jar:
2.4.3 (test), spy:memcached:jar:2.4.2 (compile),
org.apache.activemq:activemq-core:jar:5.2.0 (compile),
org.apache.activemq:activemq-pool:jar:5.2.0 (compile),
org.springframework:spring-jms:jar:2.5.6.SEC02 (compile),
javax.ejb:ejb-api:jar:3.0 (compile), commons-lang:commons-lang:jar:2.4
(compile), commons-codec:commons-codec:jar:1.6 (compile),
javax.servlet:servlet-api:jar:2.5 (compile),
org.springframework.security:spring-security-core:jar:2.0.6.RELEASE
(compile), org.codehaus.spring-security-oauth:spring-security-
oauth:jar:3.19-ES (compile), org.springframework.ldap:spring-ldap-
core:jar:1.3.1.RELEASE (compile), net.sf.gilead:gilead-hibernate:jar:
1.3.2 (compile), com.google.gwt:gwt-servlet:jar:2.2.0 (runtime),
com.google.gwt:gwt-user:jar:2.2.0 (provided),
net.sf.gilead:gilead4gwt:jar:1.3.2 (compile), org.apache.lucene:lucene-
core:jar:2.9.4 (compile), org.apache.lucene:lucene-snowball:jar:2.9.4
(compile), org.apache.solr:solr-common:jar:1.3.0 (compile),
org.apache.solr:solr-core:jar:1.4.1 (compile), org.hibernate:hibernate-
annotations:jar:3.4.0.GA (compile), org.hibernate:hibernate-commons-
annotations:jar:3.1.0.GA (compile), org.hibernate:hibernate-core:jar:
3.3.2.GA (compile), org.hibernate:hibernate-entitymanager:jar:3.4.0.GA
(compile), org.hibernate:hibernate-validator:jar:3.1.0.GA (compile),
org.hibernate:hibernate-search:jar:3.1.0.GA (compile),
org.aspectj:aspectjrt:jar:1.5.4 (compile),
org.aspectj:aspectjweaver:jar:1.5.4 (compile), com.mortennobel:java-
image-scaling:jar:0.8.5 (compile), org.jasypt:jasypt:jar:1.8-NoDeps
(compile)]
cause : Could not resolve dependencies for project
org.eurekastreams:eurekastreams-server:jar:2.0-SNAPSHOT: Failed to
collect dependencies for [rome:rome:jar:1.0 (compile), rome:rome-
fetcher:jar:1.0 (compile), rome:modules:jar:0.3.2 (compile),
org.restlet:org.restlet:jar:1.1.10 (compile),
org.restlet:org.restlet.ext.spring:jar:1.1.10 (compile),
com.noelios.restlet:com.noelios.restlet:jar:1.1.10 (compile),
com.noelios.restlet:com.noelios.restlet.ext.jetty:jar:1.1.10
(compile), com.noelios.restlet:com.noelios.restlet.ext.servlet:jar:
1.1.10 (compile),
com.noelios.restlet:com.noelios.restlet.ext.spring:jar:1.1.10
(compile), org.jsecurity:jsecurity:jar:0.9.0 (compile),
com.ibm.icu:icu4j:jar:3.8 (compile), org.codehaus.woodstox:wstx-
asl:jar:3.2.7 (compile), org.codehaus.jackson:jackson-core-asl:jar:
1.6.0 (compile), org.codehaus.jackson:jackson-jaxrs:jar:1.6.0
(compile), org.codehaus.jackson:jackson-mapper-asl:jar:1.6.0
(compile), net.oauth.core:oauth:jar:20100527 (compile),
net.oauth.core:oauth-provider:jar:20100527 (compile),
net.oauth.core:oauth-httpclient4:jar:20090913 (compile),
org.apache.shindig:shindig-server:war:2.0.1.3 (compile),
org.apache.shindig:shindig-social-api:jar:2.0.1.3 (compile),
org.apache.shindig:shindig-common:jar:2.0.1.3 (compile),
org.apache.shindig:shindig-common:jar:tests:2.0.1.3 (test),
org.apache.shindig:shindig-gadgets:jar:2.0.1.3 (compile),
javax.mail:mail:jar:1.4.2 (compile), net.sf.json-lib:json-
lib:jar:jdk15:2.2 (compile), com.google.inject:guice:jar:2.0
(compile), com.google.inject.extensions:guice-spring:jar:2.0
(compile), com.google.inject.extensions:guice-multibindings:jar:2.0
(compile), com.google.guava:guava:jar:r06 (compile),
org.apache.velocity:velocity:jar:1.7 (compile), oro:oro:jar:2.0.8
(compile), org.apache.velocity:velocity-tools:jar:2.0 (compile),
cglib:cglib-nodep:jar:2.2 (compile), asm:asm:jar:1.5.3 (compile),
asm:asm-attrs:jar:1.5.3 (compile), junit:junit:jar:4.8.2 (test),
org.springframework:spring:jar:2.5.6.SEC02 (compile), org.jmock:jmock-
junit4:jar:2.5.1 (compile), org.jmock:jmock-legacy:jar:2.5.1 (test),
hsqldb:hsqldb:jar:1.8.0.7 (test), commons-dbcp:commons-dbcp:jar:1.2.2
(compile), log4j:log4j:jar:1.2.12 (compile), org.slf4j:slf4j-api:jar:
1.6.1 (compile), org.slf4j:slf4j-log4j12:jar:1.6.1 (compile),
org.springframework:spring-test:jar:2.5.6.SEC02 (compile),
net.sf.gilead:gilead-core:jar:1.3.2 (compile), org.dbunit:dbunit:jar:
2.4.3 (test), spy:memcached:jar:2.4.2 (compile),
org.apache.activemq:activemq-core:jar:5.2.0 (compile),
org.apache.activemq:activemq-pool:jar:5.2.0 (compile),
org.springframework:spring-jms:jar:2.5.6.SEC02 (compile),
javax.ejb:ejb-api:jar:3.0 (compile), commons-lang:commons-lang:jar:2.4
(compile), commons-codec:commons-codec:jar:1.6 (compile),
javax.servlet:servlet-api:jar:2.5 (compile),
org.springframework.security:spring-security-core:jar:2.0.6.RELEASE
(compile), org.codehaus.spring-security-oauth:spring-security-
oauth:jar:3.19-ES (compile), org.springframework.ldap:spring-ldap-
core:jar:1.3.1.RELEASE (compile), net.sf.gilead:gilead-hibernate:jar:
1.3.2 (compile), com.google.gwt:gwt-servlet:jar:2.2.0 (runtime),
com.google.gwt:gwt-user:jar:2.2.0 (provided),
net.sf.gilead:gilead4gwt:jar:1.3.2 (compile), org.apache.lucene:lucene-
core:jar:2.9.4 (compile), org.apache.lucene:lucene-snowball:jar:2.9.4
(compile), org.apache.solr:solr-common:jar:1.3.0 (compile),
org.apache.solr:solr-core:jar:1.4.1 (compile), org.hibernate:hibernate-
annotations:jar:3.4.0.GA (compile), org.hibernate:hibernate-commons-
annotations:jar:3.1.0.GA (compile), org.hibernate:hibernate-core:jar:
3.3.2.GA (compile), org.hibernate:hibernate-entitymanager:jar:3.4.0.GA
(compile), org.hibernate:hibernate-validator:jar:3.1.0.GA (compile),
org.hibernate:hibernate-search:jar:3.1.0.GA (compile),
org.aspectj:aspectjrt:jar:1.5.4 (compile),
org.aspectj:aspectjweaver:jar:1.5.4 (compile), com.mortennobel:java-
image-scaling:jar:0.8.5 (compile), org.jasypt:jasypt:jar:1.8-NoDeps
(compile)]
Stack trace :
org.apache.maven.lifecycle.LifecycleExecutionException: Failed to
execute goal on project eurekastreams-server: Could not resolve
dependencies for project org.eurekastreams:eurekastreams-server:jar:
2.0-SNAPSHOT: Failed to collect dependencies for [rome:rome:jar:1.0
(compile), rome:rome-fetcher:jar:1.0 (compile), rome:modules:jar:0.3.2
(compile), org.restlet:org.restlet:jar:1.1.10 (compile),
org.restlet:org.restlet.ext.spring:jar:1.1.10 (compile),
com.noelios.restlet:com.noelios.restlet:jar:1.1.10 (compile),
com.noelios.restlet:com.noelios.restlet.ext.jetty:jar:1.1.10
(compile), com.noelios.restlet:com.noelios.restlet.ext.servlet:jar:
1.1.10 (compile),
com.noelios.restlet:com.noelios.restlet.ext.spring:jar:1.1.10
(compile), org.jsecurity:jsecurity:jar:0.9.0 (compile),
com.ibm.icu:icu4j:jar:3.8 (compile), org.codehaus.woodstox:wstx-
asl:jar:3.2.7 (compile), org.codehaus.jackson:jackson-core-asl:jar:
1.6.0 (compile), org.codehaus.jackson:jackson-jaxrs:jar:1.6.0
(compile), org.codehaus.jackson:jackson-mapper-asl:jar:1.6.0
(compile), net.oauth.core:oauth:jar:20100527 (compile),
net.oauth.core:oauth-provider:jar:20100527 (compile),
net.oauth.core:oauth-httpclient4:jar:20090913 (compile),
org.apache.shindig:shindig-server:war:2.0.1.3 (compile),
org.apache.shindig:shindig-social-api:jar:2.0.1.3 (compile),
org.apache.shindig:shindig-common:jar:2.0.1.3 (compile),
org.apache.shindig:shindig-common:jar:tests:2.0.1.3 (test),
org.apache.shindig:shindig-gadgets:jar:2.0.1.3 (compile),
javax.mail:mail:jar:1.4.2 (compile), net.sf.json-lib:json-
lib:jar:jdk15:2.2 (compile), com.google.inject:guice:jar:2.0
(compile), com.google.inject.extensions:guice-spring:jar:2.0
(compile), com.google.inject.extensions:guice-multibindings:jar:2.0
(compile), com.google.guava:guava:jar:r06 (compile),
org.apache.velocity:velocity:jar:1.7 (compile), oro:oro:jar:2.0.8
(compile), org.apache.velocity:velocity-tools:jar:2.0 (compile),
cglib:cglib-nodep:jar:2.2 (compile), asm:asm:jar:1.5.3 (compile),
asm:asm-attrs:jar:1.5.3 (compile), junit:junit:jar:4.8.2 (test),
org.springframework:spring:jar:2.5.6.SEC02 (compile), org.jmock:jmock-
junit4:jar:2.5.1 (compile), org.jmock:jmock-legacy:jar:2.5.1 (test),
hsqldb:hsqldb:jar:1.8.0.7 (test), commons-dbcp:commons-dbcp:jar:1.2.2
(compile), log4j:log4j:jar:1.2.12 (compile), org.slf4j:slf4j-api:jar:
1.6.1 (compile), org.slf4j:slf4j-log4j12:jar:1.6.1 (compile),
org.springframework:spring-test:jar:2.5.6.SEC02 (compile),
net.sf.gilead:gilead-core:jar:1.3.2 (compile), org.dbunit:dbunit:jar:
2.4.3 (test), spy:memcached:jar:2.4.2 (compile),
org.apache.activemq:activemq-core:jar:5.2.0 (compile),
org.apache.activemq:activemq-pool:jar:5.2.0 (compile),
org.springframework:spring-jms:jar:2.5.6.SEC02 (compile),
javax.ejb:ejb-api:jar:3.0 (compile), commons-lang:commons-lang:jar:2.4
(compile), commons-codec:commons-codec:jar:1.6 (compile),
javax.servlet:servlet-api:jar:2.5 (compile),
org.springframework.security:spring-security-core:jar:2.0.6.RELEASE
(compile), org.codehaus.spring-security-oauth:spring-security-
oauth:jar:3.19-ES (compile), org.springframework.ldap:spring-ldap-
core:jar:1.3.1.RELEASE (compile), net.sf.gilead:gilead-hibernate:jar:
1.3.2 (compile), com.google.gwt:gwt-servlet:jar:2.2.0 (runtime),
com.google.gwt:gwt-user:jar:2.2.0 (provided),
net.sf.gilead:gilead4gwt:jar:1.3.2 (compile), org.apache.lucene:lucene-
core:jar:2.9.4 (compile), org.apache.lucene:lucene-snowball:jar:2.9.4
(compile), org.apache.solr:solr-common:jar:1.3.0 (compile),
org.apache.solr:solr-core:jar:1.4.1 (compile), org.hibernate:hibernate-
annotations:jar:3.4.0.GA (compile), org.hibernate:hibernate-commons-
annotations:jar:3.1.0.GA (compile), org.hibernate:hibernate-core:jar:
3.3.2.GA (compile), org.hibernate:hibernate-entitymanager:jar:3.4.0.GA
(compile), org.hibernate:hibernate-validator:jar:3.1.0.GA (compile),
org.hibernate:hibernate-search:jar:3.1.0.GA (compile),
org.aspectj:aspectjrt:jar:1.5.4 (compile),
org.aspectj:aspectjweaver:jar:1.5.4 (compile), com.mortennobel:java-
image-scaling:jar:0.8.5 (compile), org.jasypt:jasypt:jar:1.8-NoDeps
(compile)]
        at
org.apache.maven.lifecycle.internal.LifecycleDependencyResolver.getDependencies(LifecycleDependencyResolver.java:
210)
        at
org.apache.maven.lifecycle.internal.LifecycleDependencyResolver.resolveProjectDependencies(LifecycleDependencyResolver.java:
117)
        at
org.apache.maven.lifecycle.internal.MojoExecutor.ensureDependenciesAreResolved(MojoExecutor.java:
258)
        at
org.apache.maven.lifecycle.internal.MojoExecutor.execute(MojoExecutor.java:
201)
        at
org.apache.maven.lifecycle.internal.MojoExecutor.execute(MojoExecutor.java:
153)
        at
org.apache.maven.lifecycle.internal.MojoExecutor.execute(MojoExecutor.java:
145)
        at
org.apache.maven.lifecycle.internal.LifecycleModuleBuilder.buildProject(LifecycleModuleBuilder.java:
84)
        at
org.apache.maven.lifecycle.internal.LifecycleModuleBuilder.buildProject(LifecycleModuleBuilder.java:
59)
        at
org.apache.maven.lifecycle.internal.LifecycleStarter.singleThreadedBuild(LifecycleStarter.java:
183)
        at
org.apache.maven.lifecycle.internal.LifecycleStarter.execute(LifecycleStarter.java:
161)
        at org.apache.maven.DefaultMaven.doExecute(DefaultMaven.java:320)
        at org.apache.maven.DefaultMaven.execute(DefaultMaven.java:156)
        at
org.jvnet.hudson.maven3.launcher.Maven3Launcher.main(Maven3Launcher.java:
79)
        at sun.reflect.NativeMethodAccessorImpl.invoke0(Native Method)
        at
sun.reflect.NativeMethodAccessorImpl.invoke(NativeMethodAccessorImpl.java:
57)
        at
sun.reflect.DelegatingMethodAccessorImpl.invoke(DelegatingMethodAccessorImpl.java:
43)
        at java.lang.reflect.Method.invoke(Method.java:616)
        at
org.codehaus.plexus.classworlds.launcher.Launcher.launchStandard(Launcher.java:
329)
        at
org.codehaus.plexus.classworlds.launcher.Launcher.launch(Launcher.java:
239)
        at org.jvnet.hudson.maven3.agent.Maven3Main.launch(Maven3Main.java:
158)
        at hudson.maven.Maven3Builder.call(Maven3Builder.java:98)
        at hudson.maven.Maven3Builder.call(Maven3Builder.java:64)
        at hudson.remoting.UserRequest.perform(UserRequest.java:118)
        at hudson.remoting.UserRequest.perform(UserRequest.java:48)
        at hudson.remoting.Request$2.run(Request.java:287)
        at hudson.remoting.InterceptingExecutorService
$1.call(InterceptingExecutorService.java:72)
        at java.util.concurrent.FutureTask$Sync.innerRun(FutureTask.java:334)
        at java.util.concurrent.FutureTask.run(FutureTask.java:166)
        at
java.util.concurrent.ThreadPoolExecutor.runWorker(ThreadPoolExecutor.java:
1110)
        at java.util.concurrent.ThreadPoolExecutor
$Worker.run(ThreadPoolExecutor.java:603)
        at java.lang.Thread.run(Thread.java:679)
Caused by: org.apache.maven.project.DependencyResolutionException:
Could not resolve dependencies for project
org.eurekastreams:eurekastreams-server:jar:2.0-SNAPSHOT: Failed to
collect dependencies for [rome:rome:jar:1.0 (compile), rome:rome-
fetcher:jar:1.0 (compile), rome:modules:jar:0.3.2 (compile),
org.restlet:org.restlet:jar:1.1.10 (compile),
org.restlet:org.restlet.ext.spring:jar:1.1.10 (compile),
com.noelios.restlet:com.noelios.restlet:jar:1.1.10 (compile),
com.noelios.restlet:com.noelios.restlet.ext.jetty:jar:1.1.10
(compile), com.noelios.restlet:com.noelios.restlet.ext.servlet:jar:
1.1.10 (compile),
com.noelios.restlet:com.noelios.restlet.ext.spring:jar:1.1.10
(compile), org.jsecurity:jsecurity:jar:0.9.0 (compile),
com.ibm.icu:icu4j:jar:3.8 (compile), org.codehaus.woodstox:wstx-
asl:jar:3.2.7 (compile), org.codehaus.jackson:jackson-core-asl:jar:
1.6.0 (compile), org.codehaus.jackson:jackson-jaxrs:jar:1.6.0
(compile), org.codehaus.jackson:jackson-mapper-asl:jar:1.6.0
(compile), net.oauth.core:oauth:jar:20100527 (compile),
net.oauth.core:oauth-provider:jar:20100527 (compile),
net.oauth.core:oauth-httpclient4:jar:20090913 (compile),
org.apache.shindig:shindig-server:war:2.0.1.3 (compile),
org.apache.shindig:shindig-social-api:jar:2.0.1.3 (compile),
org.apache.shindig:shindig-common:jar:2.0.1.3 (compile),
org.apache.shindig:shindig-common:jar:tests:2.0.1.3 (test),
org.apache.shindig:shindig-gadgets:jar:2.0.1.3 (compile),
javax.mail:mail:jar:1.4.2 (compile), net.sf.json-lib:json-
lib:jar:jdk15:2.2 (compile), com.google.inject:guice:jar:2.0
(compile), com.google.inject.extensions:guice-spring:jar:2.0
(compile), com.google.inject.extensions:guice-multibindings:jar:2.0
(compile), com.google.guava:guava:jar:r06 (compile),
org.apache.velocity:velocity:jar:1.7 (compile), oro:oro:jar:2.0.8
(compile), org.apache.velocity:velocity-tools:jar:2.0 (compile),
cglib:cglib-nodep:jar:2.2 (compile), asm:asm:jar:1.5.3 (compile),
asm:asm-attrs:jar:1.5.3 (compile), junit:junit:jar:4.8.2 (test),
org.springframework:spring:jar:2.5.6.SEC02 (compile), org.jmock:jmock-
junit4:jar:2.5.1 (compile), org.jmock:jmock-legacy:jar:2.5.1 (test),
hsqldb:hsqldb:jar:1.8.0.7 (test), commons-dbcp:commons-dbcp:jar:1.2.2
(compile), log4j:log4j:jar:1.2.12 (compile), org.slf4j:slf4j-api:jar:
1.6.1 (compile), org.slf4j:slf4j-log4j12:jar:1.6.1 (compile),
org.springframework:spring-test:jar:2.5.6.SEC02 (compile),
net.sf.gilead:gilead-core:jar:1.3.2 (compile), org.dbunit:dbunit:jar:
2.4.3 (test), spy:memcached:jar:2.4.2 (compile),
org.apache.activemq:activemq-core:jar:5.2.0 (compile),
org.apache.activemq:activemq-pool:jar:5.2.0 (compile),
org.springframework:spring-jms:jar:2.5.6.SEC02 (compile),
javax.ejb:ejb-api:jar:3.0 (compile), commons-lang:commons-lang:jar:2.4
(compile), commons-codec:commons-codec:jar:1.6 (compile),
javax.servlet:servlet-api:jar:2.5 (compile),
org.springframework.security:spring-security-core:jar:2.0.6.RELEASE
(compile), org.codehaus.spring-security-oauth:spring-security-
oauth:jar:3.19-ES (compile), org.springframework.ldap:spring-ldap-
core:jar:1.3.1.RELEASE (compile), net.sf.gilead:gilead-hibernate:jar:
1.3.2 (compile), com.google.gwt:gwt-servlet:jar:2.2.0 (runtime),
com.google.gwt:gwt-user:jar:2.2.0 (provided),
net.sf.gilead:gilead4gwt:jar:1.3.2 (compile), org.apache.lucene:lucene-
core:jar:2.9.4 (compile), org.apache.lucene:lucene-snowball:jar:2.9.4
(compile), org.apache.solr:solr-common:jar:1.3.0 (compile),
org.apache.solr:solr-core:jar:1.4.1 (compile), org.hibernate:hibernate-
annotations:jar:3.4.0.GA (compile), org.hibernate:hibernate-commons-
annotations:jar:3.1.0.GA (compile), org.hibernate:hibernate-core:jar:
3.3.2.GA (compile), org.hibernate:hibernate-entitymanager:jar:3.4.0.GA
(compile), org.hibernate:hibernate-validator:jar:3.1.0.GA (compile),
org.hibernate:hibernate-search:jar:3.1.0.GA (compile),
org.aspectj:aspectjrt:jar:1.5.4 (compile),
org.aspectj:aspectjweaver:jar:1.5.4 (compile), com.mortennobel:java-
image-scaling:jar:0.8.5 (compile), org.jasypt:jasypt:jar:1.8-NoDeps
(compile)]
        at
org.apache.maven.project.DefaultProjectDependenciesResolver.resolve(DefaultProjectDependenciesResolver.java:
158)
        at
org.apache.maven.lifecycle.internal.LifecycleDependencyResolver.getDependencies(LifecycleDependencyResolver.java:
185)
        ... 30 more
Caused by:
org.sonatype.aether.collection.DependencyCollectionException: Failed
to collect dependencies for [rome:rome:jar:1.0 (compile), rome:rome-
fetcher:jar:1.0 (compile), rome:modules:jar:0.3.2 (compile),
org.restlet:org.restlet:jar:1.1.10 (compile),
org.restlet:org.restlet.ext.spring:jar:1.1.10 (compile),
com.noelios.restlet:com.noelios.restlet:jar:1.1.10 (compile),
com.noelios.restlet:com.noelios.restlet.ext.jetty:jar:1.1.10
(compile), com.noelios.restlet:com.noelios.restlet.ext.servlet:jar:
1.1.10 (compile),
com.noelios.restlet:com.noelios.restlet.ext.spring:jar:1.1.10
(compile), org.jsecurity:jsecurity:jar:0.9.0 (compile),
com.ibm.icu:icu4j:jar:3.8 (compile), org.codehaus.woodstox:wstx-
asl:jar:3.2.7 (compile), org.codehaus.jackson:jackson-core-asl:jar:
1.6.0 (compile), org.codehaus.jackson:jackson-jaxrs:jar:1.6.0
(compile), org.codehaus.jackson:jackson-mapper-asl:jar:1.6.0
(compile), net.oauth.core:oauth:jar:20100527 (compile),
net.oauth.core:oauth-provider:jar:20100527 (compile),
net.oauth.core:oauth-httpclient4:jar:20090913 (compile),
org.apache.shindig:shindig-server:war:2.0.1.3 (compile),
org.apache.shindig:shindig-social-api:jar:2.0.1.3 (compile),
org.apache.shindig:shindig-common:jar:2.0.1.3 (compile),
org.apache.shindig:shindig-common:jar:tests:2.0.1.3 (test),
org.apache.shindig:shindig-gadgets:jar:2.0.1.3 (compile),
javax.mail:mail:jar:1.4.2 (compile), net.sf.json-lib:json-
lib:jar:jdk15:2.2 (compile), com.google.inject:guice:jar:2.0
(compile), com.google.inject.extensions:guice-spring:jar:2.0
(compile), com.google.inject.extensions:guice-multibindings:jar:2.0
(compile), com.google.guava:guava:jar:r06 (compile),
org.apache.velocity:velocity:jar:1.7 (compile), oro:oro:jar:2.0.8
(compile), org.apache.velocity:velocity-tools:jar:2.0 (compile),
cglib:cglib-nodep:jar:2.2 (compile), asm:asm:jar:1.5.3 (compile),
asm:asm-attrs:jar:1.5.3 (compile), junit:junit:jar:4.8.2 (test),
org.springframework:spring:jar:2.5.6.SEC02 (compile), org.jmock:jmock-
junit4:jar:2.5.1 (compile), org.jmock:jmock-legacy:jar:2.5.1 (test),
hsqldb:hsqldb:jar:1.8.0.7 (test), commons-dbcp:commons-dbcp:jar:1.2.2
(compile), log4j:log4j:jar:1.2.12 (compile), org.slf4j:slf4j-api:jar:
1.6.1 (compile), org.slf4j:slf4j-log4j12:jar:1.6.1 (compile),
org.springframework:spring-test:jar:2.5.6.SEC02 (compile),
net.sf.gilead:gilead-core:jar:1.3.2 (compile), org.dbunit:dbunit:jar:
2.4.3 (test), spy:memcached:jar:2.4.2 (compile),
org.apache.activemq:activemq-core:jar:5.2.0 (compile),
org.apache.activemq:activemq-pool:jar:5.2.0 (compile),
org.springframework:spring-jms:jar:2.5.6.SEC02 (compile),
javax.ejb:ejb-api:jar:3.0 (compile), commons-lang:commons-lang:jar:2.4
(compile), commons-codec:commons-codec:jar:1.6 (compile),
javax.servlet:servlet-api:jar:2.5 (compile),
org.springframework.security:spring-security-core:jar:2.0.6.RELEASE
(compile), org.codehaus.spring-security-oauth:spring-security-
oauth:jar:3.19-ES (compile), org.springframework.ldap:spring-ldap-
core:jar:1.3.1.RELEASE (compile), net.sf.gilead:gilead-hibernate:jar:
1.3.2 (compile), com.google.gwt:gwt-servlet:jar:2.2.0 (runtime),
com.google.gwt:gwt-user:jar:2.2.0 (provided),
net.sf.gilead:gilead4gwt:jar:1.3.2 (compile), org.apache.lucene:lucene-
core:jar:2.9.4 (compile), org.apache.lucene:lucene-snowball:jar:2.9.4
(compile), org.apache.solr:solr-common:jar:1.3.0 (compile),
org.apache.solr:solr-core:jar:1.4.1 (compile), org.hibernate:hibernate-
annotations:jar:3.4.0.GA (compile), org.hibernate:hibernate-commons-
annotations:jar:3.1.0.GA (compile), org.hibernate:hibernate-core:jar:
3.3.2.GA (compile), org.hibernate:hibernate-entitymanager:jar:3.4.0.GA
(compile), org.hibernate:hibernate-validator:jar:3.1.0.GA (compile),
org.hibernate:hibernate-search:jar:3.1.0.GA (compile),
org.aspectj:aspectjrt:jar:1.5.4 (compile),
org.aspectj:aspectjweaver:jar:1.5.4 (compile), com.mortennobel:java-
image-scaling:jar:0.8.5 (compile), org.jasypt:jasypt:jar:1.8-NoDeps
(compile)]
        at
org.sonatype.aether.impl.internal.DefaultDependencyCollector.collectDependencies(DefaultDependencyCollector.java:
258)
        at
org.sonatype.aether.impl.internal.DefaultRepositorySystem.collectDependencies(DefaultRepositorySystem.java:
308)
        at
org.apache.maven.project.DefaultProjectDependenciesResolver.resolve(DefaultProjectDependenciesResolver.java:
150)
        ... 31 more
Caused by: org.sonatype.aether.resolution.ArtifactDescriptorException:
Failed to read artifact descriptor for org.jboss.aop:jboss-aop:jar:
2.0.0-SNAPSHOT
        at
org.apache.maven.repository.internal.DefaultArtifactDescriptorReader.loadPom(DefaultArtifactDescriptorReader.java:
296)
        at
org.apache.maven.repository.internal.DefaultArtifactDescriptorReader.readArtifactDescriptor(DefaultArtifactDescriptorReader.java:
186)
        at
org.sonatype.aether.impl.internal.DefaultDependencyCollector.process(DefaultDependencyCollector.java:
412)
        at
org.sonatype.aether.impl.internal.DefaultDependencyCollector.process(DefaultDependencyCollector.java:
544)
        at
org.sonatype.aether.impl.internal.DefaultDependencyCollector.process(DefaultDependencyCollector.java:
544)
        at
org.sonatype.aether.impl.internal.DefaultDependencyCollector.process(DefaultDependencyCollector.java:
544)
        at
org.sonatype.aether.impl.internal.DefaultDependencyCollector.collectDependencies(DefaultDependencyCollector.java:
240)
        ... 33 more
Caused by: org.sonatype.aether.resolution.ArtifactResolutionException:
Could not transfer artifact org.jboss.aop:jboss-aop:pom:2.0.0-SNAPSHOT
from/to jboss (http://repository.jboss.com/maven2): Access denied to:
http://repository.jboss.com/maven2/org/jboss/aop/jboss-aop/2.0.0-SNAPSHOT/jboss-aop-2.0.0-SNAPSHOT.pom,
ReasonPhrase:Forbidden.
        at
org.sonatype.aether.impl.internal.DefaultArtifactResolver.resolve(DefaultArtifactResolver.java:
538)
        at
org.sonatype.aether.impl.internal.DefaultArtifactResolver.resolveArtifacts(DefaultArtifactResolver.java:
216)
        at
org.sonatype.aether.impl.internal.DefaultArtifactResolver.resolveArtifact(DefaultArtifactResolver.java:
193)
        at
org.apache.maven.repository.internal.DefaultArtifactDescriptorReader.loadPom(DefaultArtifactDescriptorReader.java:
281)
        ... 39 more
Caused by: org.sonatype.aether.transfer.ArtifactTransferException:
Could not transfer artifact org.jboss.aop:jboss-aop:pom:2.0.0-SNAPSHOT
from/to jboss (http://repository.jboss.com/maven2): Access denied to:
http://repository.jboss.com/maven2/org/jboss/aop/jboss-aop/2.0.0-SNAPSHOT/jboss-aop-2.0.0-SNAPSHOT.pom,
ReasonPhrase:Forbidden.
        at org.sonatype.aether.connector.wagon.WagonRepositoryConnector
$4.wrap(WagonRepositoryConnector.java:951)
        at org.sonatype.aether.connector.wagon.WagonRepositoryConnector
$4.wrap(WagonRepositoryConnector.java:941)
        at org.sonatype.aether.connector.wagon.WagonRepositoryConnector
$GetTask.run(WagonRepositoryConnector.java:669)
        at org.sonatype.aether.util.concurrency.RunnableErrorForwarder
$1.run(RunnableErrorForwarder.java:60)
        ... 3 more
Caused by:
org.apache.maven.wagon.authorization.AuthorizationException: Access
denied to: 
http://repository.jboss.com/maven2/org/jboss/aop/jboss-aop/2.0.0-SNAPSHOT/jboss-aop-2.0.0-SNAPSHOT.pom,
ReasonPhrase:Forbidden.
        at
org.apache.maven.wagon.shared.http4.AbstractHttpClientWagon.fillInputData(AbstractHttpClientWagon.java:
835)
        at org.apache.maven.wagon.StreamWagon.getInputStream(StreamWagon.java:
116)
        at org.apache.maven.wagon.StreamWagon.getIfNewer(StreamWagon.java:88)
        at org.apache.maven.wagon.StreamWagon.get(StreamWagon.java:61)
        at org.sonatype.aether.connector.wagon.WagonRepositoryConnector
$GetTask.run(WagonRepositoryConnector.java:601)
        ... 4 more
channel stopped
Finished: FAILURE
msgmiddle
<Prev in Thread] Current Thread [Next in Thread>
  • Fails on maven dependency resolution,
    • Re: Fails on maven dependency resolution
    • RE: Fails on maven dependency resolution
Current Sitemap | © 2012 planetjava | Contact | Privacy Policy