PlanetJava
Custom Search

java-htmlunit-devel
[Top] [All Lists]

[HtmlUnit] htmlunit Build Failed

Subject: [HtmlUnit] htmlunit Build Failed
Date: Wed, 19 Sep 2012 14:04:57 +0200 (CEST)
<html>
<head>
<META http-equiv="Content-Type" content="text/html; charset=UTF-8">
<title>CruiseControl Build Result</title>
</head>
<body>
<h1 xmlns:xslt="http://xml.apache.org/xslt";>BUILD FAILED</h1>
<table>
<tr>
<th>Date of build</th><td>09/19/2012 12:38:36</td>
</tr>
<tr>
<th>Time to build</th><td>86 minute(s) 8 second(s)</td>
</tr>
<tr>
<th>Last changed</th><td>09/19/2012 12:36:31</td>
</tr>
<tr>
<th>Last log entry</th><td>More annotations</td>
</tr>
</table>
<h2>Ant Error Message</h2>
<pre>Return code is 1</pre>
<pre></pre>
<h2>Unit Tests</h2>
<p>Test cases: <b>17607</b>, passed: <b>17294</b>, failures: <b>141</b>, 
errors: <b>172</b>.</p>
<table cellpadding="0" cellspacing="0" bgcolor="white" id="utests">
<tr>
<td bgcolor="green" width="98.2222979496791%">
                                                 
                                        </td><td bgcolor="#FFFFA0" 
width="1.7777020503208951%">
                                                 
                                        </td>
</tr>
</table>
<h3>Errors</h3>
<ul>
<li class="oddrow">WebClient3Test.readStreamTwice [FF3.6]</li>
<li class="evenrow">WebClient3Test.readStreamTwice [IE6]</li>
<li class="oddrow">WebClient3Test.readStreamTwice [IE7]</li>
<li class="evenrow">WebClient3Test.readStreamTwice [IE8]</li>
<li class="oddrow">WebClientTest.testHtmlWindowEvents_closedFromFrame 
[FF3.6]</li>
<li class="evenrow">WebClientTest.testHtmlWindowEvents_closedFromFrame 
[IE6]</li>
<li class="oddrow">WebClientTest.testHtmlWindowEvents_closedFromFrame [IE7]</li>
<li class="evenrow">WebClientTest.testHtmlWindowEvents_closedFromFrame 
[IE8]</li>
<li class="oddrow">BaseFrameElementTest.removeIFrameAndAddAgain [FF3.6]</li>
<li class="evenrow">BaseFrameElementTest.removeIFrameAndAddAgain [IE6]</li>
<li class="oddrow">BaseFrameElementTest.removeIFrameAndAddAgain [IE7]</li>
<li class="evenrow">BaseFrameElementTest.removeIFrameAndAddAgain [IE8]</li>
<li class="oddrow">HtmlButtonTest.testReset [FF3.6]</li>
<li class="evenrow">HtmlButtonTest.testReset [IE6]</li>
<li class="oddrow">HtmlButtonTest.testReset [IE7]</li>
<li class="evenrow">HtmlButtonTest.testReset [IE8]</li>
<li class="oddrow">HtmlInlineFrameTest.testFrameSetInnerHtmlDoesLoadFrame 
[FF3.6]</li>
<li 
class="evenrow">HtmlInlineFrameTest.testFrameSetInnerHtmlDoesLoadFrameContentTimeout
 [FF3.6]</li>
<li class="oddrow">HtmlInlineFrameTest.testFrameWriteDoesNotReloadFrame 
[FF3.6]</li>
<li class="evenrow">HtmlInlineFrameTest.testInvalidSrcAttribute [FF3.6]</li>
<li class="oddrow">HtmlInlineFrameTest.testRecursiveNestedFrames [FF3.6]</li>
<li class="evenrow">HtmlInlineFrameTest.testRecursiveSrcAttribute [FF3.6]</li>
<li class="oddrow">HtmlInlineFrameTest.testSetSrcAttribute [FF3.6]</li>
<li class="evenrow">HtmlInlineFrameTest.testSetSrcAttributeWithWhiteSpaces 
[FF3.6]</li>
<li class="oddrow">HtmlInlineFrameTest.testSetSrcAttribute_ViaJavaScript 
[FF3.6]</li>
<li class="evenrow">HtmlInlineFrameTest.testFrameSetInnerHtmlDoesLoadFrame 
[IE6]</li>
<li 
class="oddrow">HtmlInlineFrameTest.testFrameSetInnerHtmlDoesLoadFrameContentTimeout
 [IE6]</li>
<li class="evenrow">HtmlInlineFrameTest.testFrameWriteDoesNotReloadFrame 
[IE6]</li>
<li class="oddrow">HtmlInlineFrameTest.testInvalidSrcAttribute [IE6]</li>
<li class="evenrow">HtmlInlineFrameTest.testRecursiveNestedFrames [IE6]</li>
<li class="oddrow">HtmlInlineFrameTest.testRecursiveSrcAttribute [IE6]</li>
<li class="evenrow">HtmlInlineFrameTest.testSetSrcAttribute [IE6]</li>
<li class="oddrow">HtmlInlineFrameTest.testSetSrcAttributeWithWhiteSpaces 
[IE6]</li>
<li class="evenrow">HtmlInlineFrameTest.testSetSrcAttribute_ViaJavaScript 
[IE6]</li>
<li class="oddrow">HtmlInlineFrameTest.testFrameSetInnerHtmlDoesLoadFrame 
[IE7]</li>
<li 
class="evenrow">HtmlInlineFrameTest.testFrameSetInnerHtmlDoesLoadFrameContentTimeout
 [IE7]</li>
<li class="oddrow">HtmlInlineFrameTest.testFrameWriteDoesNotReloadFrame 
[IE7]</li>
<li class="evenrow">HtmlInlineFrameTest.testInvalidSrcAttribute [IE7]</li>
<li class="oddrow">HtmlInlineFrameTest.testRecursiveNestedFrames [IE7]</li>
<li class="evenrow">HtmlInlineFrameTest.testRecursiveSrcAttribute [IE7]</li>
<li class="oddrow">HtmlInlineFrameTest.testSetSrcAttribute [IE7]</li>
<li class="evenrow">HtmlInlineFrameTest.testSetSrcAttributeWithWhiteSpaces 
[IE7]</li>
<li class="oddrow">HtmlInlineFrameTest.testSetSrcAttribute_ViaJavaScript 
[IE7]</li>
<li class="evenrow">HtmlInlineFrameTest.testFrameSetInnerHtmlDoesLoadFrame 
[IE8]</li>
<li 
class="oddrow">HtmlInlineFrameTest.testFrameSetInnerHtmlDoesLoadFrameContentTimeout
 [IE8]</li>
<li class="evenrow">HtmlInlineFrameTest.testFrameWriteDoesNotReloadFrame 
[IE8]</li>
<li class="oddrow">HtmlInlineFrameTest.testInvalidSrcAttribute [IE8]</li>
<li class="evenrow">HtmlInlineFrameTest.testRecursiveNestedFrames [IE8]</li>
<li class="oddrow">HtmlInlineFrameTest.testRecursiveSrcAttribute [IE8]</li>
<li class="evenrow">HtmlInlineFrameTest.testSetSrcAttribute [IE8]</li>
<li class="oddrow">HtmlInlineFrameTest.testSetSrcAttributeWithWhiteSpaces 
[IE8]</li>
<li class="evenrow">HtmlInlineFrameTest.testSetSrcAttribute_ViaJavaScript 
[IE8]</li>
<li class="oddrow">HtmlIsIndexTest.testFormSubmission [FF3.6]</li>
<li class="evenrow">HtmlIsIndexTest.testFormSubmission [IE6]</li>
<li class="oddrow">HtmlIsIndexTest.testFormSubmission [IE7]</li>
<li class="evenrow">HtmlIsIndexTest.testFormSubmission [IE8]</li>
<li class="oddrow">HtmlPageTest.testNoSlashURL [FF3.6]</li>
<li class="evenrow">HtmlResetInputTest.reset [FF3.6]</li>
<li class="oddrow">HtmlResetInputTest.reset [IE6]</li>
<li class="evenrow">HtmlResetInputTest.reset [IE7]</li>
<li class="oddrow">HtmlResetInputTest.reset [IE8]</li>
<li class="evenrow">JavaScriptEngine2Test.jsRunSingleThreadedBrowserWide 
[FF3.6]</li>
<li class="oddrow">JavaScriptEngine2Test.jsRunSingleThreadedBrowserWide 
[IE6]</li>
<li class="evenrow">JavaScriptEngine2Test.jsRunSingleThreadedBrowserWide 
[IE7]</li>
<li class="oddrow">JavaScriptEngine2Test.jsRunSingleThreadedBrowserWide 
[IE8]</li>
<li class="evenrow">PostponedActionTest.loadingJavaScript2 [FF3.6]</li>
<li class="oddrow">PostponedActionTest.loadingJavaScript2 [IE6]</li>
<li class="evenrow">PostponedActionTest.loadingJavaScript2 [IE7]</li>
<li class="oddrow">PostponedActionTest.loadingJavaScript2 [IE8]</li>
<li 
class="evenrow">JavaScriptJobManagerTest.navigationStopThreadsInChildWindows 
[FF3.6]</li>
<li class="oddrow">JavaScriptJobManagerTest.navigationStopThreadsInChildWindows 
[IE6]</li>
<li 
class="evenrow">JavaScriptJobManagerTest.navigationStopThreadsInChildWindows 
[IE7]</li>
<li class="oddrow">JavaScriptJobManagerTest.navigationStopThreadsInChildWindows 
[IE8]</li>
<li class="evenrow">DocumentTest.noBodyTag_IFrame [FF3.6]</li>
<li class="oddrow">DocumentTest.noBodyTag_IFrame [IE6]</li>
<li class="evenrow">DocumentTest.noBodyTag_IFrame [IE7]</li>
<li class="oddrow">DocumentTest.noBodyTag_IFrame [IE8]</li>
<li class="evenrow">Location2Test.about_blank_attributes [FF3.6]</li>
<li class="oddrow">Location2Test.about_blank_attributes [IE6]</li>
<li class="evenrow">Location2Test.about_blank_attributes [IE7]</li>
<li class="oddrow">Location2Test.about_blank_attributes [IE8]</li>
<li class="evenrow">Node2Test.event [FF3.6]</li>
<li class="oddrow">Node2Test.event [IE6]</li>
<li class="evenrow">Node2Test.event [IE7]</li>
<li class="oddrow">Node2Test.event [IE8]</li>
<li class="evenrow">SelectionTest.getSelection_display [FF3.6]</li>
<li class="oddrow">setTimeoutOnFrameWindow</li>
<li class="evenrow">WindowTest.openWindow_blank [FF3.6]</li>
<li class="oddrow">WindowTest.openWindow_parent [FF3.6]</li>
<li class="evenrow">WindowTest.openWindow_top [FF3.6]</li>
<li class="oddrow">WindowTest.openWindow_blank [IE6]</li>
<li class="evenrow">WindowTest.openWindow_parent [IE6]</li>
<li class="oddrow">WindowTest.openWindow_top [IE6]</li>
<li class="evenrow">WindowTest.openWindow_blank [IE7]</li>
<li class="oddrow">WindowTest.openWindow_parent [IE7]</li>
<li class="evenrow">WindowTest.openWindow_top [IE7]</li>
<li class="oddrow">WindowTest.openWindow_blank [IE8]</li>
<li class="evenrow">WindowTest.openWindow_parent [IE8]</li>
<li class="oddrow">WindowTest.openWindow_top [IE8]</li>
<li class="evenrow">HTMLDocument2Test.domain_set_for_about_blank [FF3.6]</li>
<li class="oddrow">HTMLDocument2Test.readyState [FF3.6]</li>
<li class="evenrow">HTMLDocument2Test.domain_set_for_about_blank [IE6]</li>
<li class="oddrow">HTMLDocument2Test.domain_set_for_about_blank [IE7]</li>
<li class="evenrow">HTMLDocument2Test.domain_set_for_about_blank [IE8]</li>
<li class="oddrow">HTMLDocumentTest.frames [IE6]</li>
<li class="evenrow">HTMLDocumentTest.frames [IE7]</li>
<li class="oddrow">HTMLDocumentTest.frames [IE8]</li>
<li class="evenrow">HTMLDocumentWrite2Test.writeInFrameWithOnload [FF3.6]</li>
<li class="oddrow">HTMLDocumentWrite2Test.writeInFrameWithOnload [IE6]</li>
<li class="evenrow">HTMLDocumentWrite2Test.writeInFrameWithOnload [IE7]</li>
<li class="oddrow">HTMLDocumentWrite2Test.writeInFrameWithOnload [IE8]</li>
<li class="evenrow">HTMLDocumentWriteTest.write_script [FF3.6]</li>
<li class="oddrow">HTMLDocumentWriteTest.write_script [IE6]</li>
<li class="evenrow">HTMLDocumentWriteTest.write_script [IE7]</li>
<li class="oddrow">HTMLDocumentWriteTest.write_script [IE8]</li>
<li 
class="evenrow">HTMLIFrameElementTest.onLoadCalledEachTimeFrameContentChanges 
[FF3.6]</li>
<li class="oddrow">HTMLIFrameElementTest.readyState_IFrame [FF3.6]</li>
<li class="evenrow">HTMLIFrameElementTest.setSrcAttribute [FF3.6]</li>
<li class="oddrow">HTMLIFrameElementTest.setSrc_JavascriptUrl [FF3.6]</li>
<li class="evenrow">HTMLIFrameElementTest.settingInnerHtmlTriggersFrameLoad 
[FF3.6]</li>
<li class="oddrow">HTMLIFrameElementTest.writeToIFrame [FF3.6]</li>
<li 
class="evenrow">HTMLIFrameElementTest.onLoadCalledEachTimeFrameContentChanges 
[IE6]</li>
<li class="oddrow">HTMLIFrameElementTest.readyState_IFrame [IE6]</li>
<li class="evenrow">HTMLIFrameElementTest.setSrcAttribute [IE6]</li>
<li class="oddrow">HTMLIFrameElementTest.setSrc_JavascriptUrl [IE6]</li>
<li class="evenrow">HTMLIFrameElementTest.settingInnerHtmlTriggersFrameLoad 
[IE6]</li>
<li class="oddrow">HTMLIFrameElementTest.writeToIFrame [IE6]</li>
<li 
class="evenrow">HTMLIFrameElementTest.onLoadCalledEachTimeFrameContentChanges 
[IE7]</li>
<li class="oddrow">HTMLIFrameElementTest.readyState_IFrame [IE7]</li>
<li class="evenrow">HTMLIFrameElementTest.setSrcAttribute [IE7]</li>
<li class="oddrow">HTMLIFrameElementTest.setSrc_JavascriptUrl [IE7]</li>
<li class="evenrow">HTMLIFrameElementTest.settingInnerHtmlTriggersFrameLoad 
[IE7]</li>
<li class="oddrow">HTMLIFrameElementTest.writeToIFrame [IE7]</li>
<li 
class="evenrow">HTMLIFrameElementTest.onLoadCalledEachTimeFrameContentChanges 
[IE8]</li>
<li class="oddrow">HTMLIFrameElementTest.readyState_IFrame [IE8]</li>
<li class="evenrow">HTMLIFrameElementTest.setSrcAttribute [IE8]</li>
<li class="oddrow">HTMLIFrameElementTest.setSrc_JavascriptUrl [IE8]</li>
<li class="evenrow">HTMLIFrameElementTest.settingInnerHtmlTriggersFrameLoad 
[IE8]</li>
<li class="oddrow">HTMLIFrameElementTest.writeToIFrame [IE8]</li>
<li class="evenrow">HTMLImageElementTest.getSrc_newImage_srcNotSet [FF3.6]</li>
<li class="oddrow">HTMLImageElementTest.newImage [FF3.6]</li>
<li class="evenrow">HTMLImageElementTest.setSrc_newImage [FF3.6]</li>
<li class="oddrow">HTMLImageElementTest.getSrc_newImage_srcNotSet [IE6]</li>
<li class="evenrow">HTMLImageElementTest.newImage [IE6]</li>
<li class="oddrow">HTMLImageElementTest.setSrc_newImage [IE6]</li>
<li class="evenrow">HTMLImageElementTest.getSrc_newImage_srcNotSet [IE7]</li>
<li class="oddrow">HTMLImageElementTest.newImage [IE7]</li>
<li class="evenrow">HTMLImageElementTest.setSrc_newImage [IE7]</li>
<li class="oddrow">HTMLImageElementTest.getSrc_newImage_srcNotSet [IE8]</li>
<li class="evenrow">HTMLImageElementTest.newImage [IE8]</li>
<li class="oddrow">HTMLImageElementTest.setSrc_newImage [IE8]</li>
<li 
class="evenrow">XMLHttpRequest3Test.testXMLHttpRequestWithDomChangeListenerDeadlock
 [FF3.6]</li>
<li 
class="oddrow">XMLHttpRequest3Test.testXMLHttpRequestWithDomChangeListenerDeadlock
 [IE6]</li>
<li 
class="evenrow">XMLHttpRequest3Test.testXMLHttpRequestWithDomChangeListenerDeadlock
 [IE7]</li>
<li 
class="oddrow">XMLHttpRequest3Test.testXMLHttpRequestWithDomChangeListenerDeadlock
 [IE8]</li>
<li class="evenrow">GWT20Test.dynaTable [FF3.6]</li>
<li class="oddrow">GWT20Test.hello [FF3.6]</li>
<li class="evenrow">GWT20Test.json [FF3.6]</li>
<li class="oddrow">GWT20Test.mail [FF3.6]</li>
<li class="evenrow">GWT20Test.showcase [FF3.6]</li>
<li class="oddrow">GWT20Test.hello [IE6]</li>
<li class="evenrow">GWT20Test.json [IE6]</li>
<li class="oddrow">GWT20Test.mail [IE6]</li>
<li class="evenrow">GWT20Test.showcase [IE6]</li>
<li class="oddrow">GWT20Test.hello [IE7]</li>
<li class="evenrow">GWT20Test.json [IE7]</li>
<li class="oddrow">GWT20Test.mail [IE7]</li>
<li class="evenrow">GWT20Test.showcase [IE7]</li>
<li class="oddrow">GWT20Test.hello [IE8]</li>
<li class="evenrow">GWT20Test.json [IE8]</li>
<li class="oddrow">GWT20Test.mail [IE8]</li>
<li class="evenrow">GWT20Test.showcase [IE8]</li>
</ul>
<h3>Failures</h3>
<ul>
<li class="oddrow">WebClientTest.testCurrentWindow [FF3.6]</li>
<li class="evenrow">WebClientTest.testCurrentWindow [IE6]</li>
<li class="oddrow">WebClientTest.testCurrentWindow [IE7]</li>
<li class="evenrow">WebClientTest.testCurrentWindow [IE8]</li>
<li class="oddrow">HtmlInlineFrame2Test.selfClosingIFrame [FF3.6]</li>
<li class="evenrow">HtmlInlineFrame2Test.simpleScriptable [FF3.6]</li>
<li class="oddrow">HtmlInlineFrame2Test.selfClosingIFrame [IE6]</li>
<li class="evenrow">HtmlInlineFrame2Test.simpleScriptable [IE6]</li>
<li class="oddrow">HtmlInlineFrame2Test.selfClosingIFrame [IE7]</li>
<li class="evenrow">HtmlInlineFrame2Test.simpleScriptable [IE7]</li>
<li class="oddrow">HtmlInlineFrame2Test.selfClosingIFrame [IE8]</li>
<li class="evenrow">HtmlInlineFrame2Test.simpleScriptable [IE8]</li>
<li class="oddrow">HtmlInlineFrameTest.testScriptUnderIFrame [IE6]</li>
<li class="evenrow">HtmlInlineFrameTest.testScriptUnderIFrame [IE7]</li>
<li class="oddrow">HtmlInlineFrameTest.testScriptUnderIFrame [IE8]</li>
<li class="evenrow">HtmlIsIndex2Test.simpleScriptable [FF3.6]</li>
<li class="oddrow">HtmlIsIndex2Test.simpleScriptable [IE6]</li>
<li class="evenrow">HtmlIsIndex2Test.simpleScriptable [IE7]</li>
<li class="oddrow">HtmlIsIndex2Test.simpleScriptable [IE8]</li>
<li class="evenrow">HtmlPage2Test.loadExternalJavaScript [FF3.6]</li>
<li class="oddrow">HtmlPage2Test.loadExternalJavaScript_absolute [FF3.6]</li>
<li class="evenrow">HtmlPage2Test.save_frames [FF3.6]</li>
<li class="oddrow">HtmlPage2Test.serialization_attributeListenerLock 
[FF3.6]</li>
<li class="evenrow">HtmlPage2Test.loadExternalJavaScript [IE6]</li>
<li class="oddrow">HtmlPage2Test.loadExternalJavaScript_absolute [IE6]</li>
<li class="evenrow">HtmlPage2Test.save_frames [IE6]</li>
<li class="oddrow">HtmlPage2Test.serialization_attributeListenerLock [IE6]</li>
<li class="evenrow">HtmlPage2Test.loadExternalJavaScript [IE7]</li>
<li class="oddrow">HtmlPage2Test.loadExternalJavaScript_absolute [IE7]</li>
<li class="evenrow">HtmlPage2Test.save_frames [IE7]</li>
<li class="oddrow">HtmlPage2Test.serialization_attributeListenerLock [IE7]</li>
<li class="evenrow">HtmlPage2Test.loadExternalJavaScript [IE8]</li>
<li class="oddrow">HtmlPage2Test.loadExternalJavaScript_absolute [IE8]</li>
<li class="evenrow">HtmlPage2Test.save_frames [IE8]</li>
<li class="oddrow">HtmlPage2Test.serialization_attributeListenerLock [IE8]</li>
<li class="evenrow">HtmlPageTest.asXmlValidHtmlOutput [FF3.6]</li>
<li class="oddrow">HtmlPageTest.asXmlValidHtmlOutput [IE6]</li>
<li class="evenrow">HtmlPageTest.asXmlValidHtmlOutput [IE7]</li>
<li class="oddrow">HtmlPageTest.asXmlValidHtmlOutput [IE8]</li>
<li class="evenrow">PostponedActionTest.loadingJavaScript [FF3.6]</li>
<li class="oddrow">PostponedActionTest.loadingJavaScript [IE6]</li>
<li class="evenrow">PostponedActionTest.loadingJavaScript [IE7]</li>
<li class="oddrow">PostponedActionTest.loadingJavaScript [IE8]</li>
<li 
class="evenrow">SimpleScriptableTest.htmlJavaScriptMapping_AllJavaScriptClassesArePresent
 [FF3.6]</li>
<li 
class="oddrow">SimpleScriptableTest.htmlJavaScriptMapping_AllJavaScriptClassesArePresent
 [IE6]</li>
<li 
class="evenrow">SimpleScriptableTest.htmlJavaScriptMapping_AllJavaScriptClassesArePresent
 [IE7]</li>
<li 
class="oddrow">SimpleScriptableTest.htmlJavaScriptMapping_AllJavaScriptClassesArePresent
 [IE8]</li>
<li class="evenrow">EventTest.testEventScope [FF3.6]</li>
<li class="oddrow">EventTest.testEventScope [IE6]</li>
<li class="evenrow">EventTest.testEventScope [IE7]</li>
<li class="oddrow">EventTest.testEventScope [IE8]</li>
<li class="evenrow">test[283]</li>
<li class="oddrow">test[311]</li>
<li class="evenrow">Window2Test.framesAreWindows [FF3.6]</li>
<li class="oddrow">Window2Test.framesAreWindows [IE6]</li>
<li class="evenrow">Window2Test.framesAreWindows [IE7]</li>
<li class="oddrow">Window2Test.framesAreWindows [IE8]</li>
<li class="evenrow">WindowTest.parentAndTop [FF3.6]</li>
<li class="oddrow">WindowTest.parentAndTop [IE6]</li>
<li class="evenrow">WindowTest.parentAndTop [IE7]</li>
<li class="oddrow">WindowTest.parentAndTop [IE8]</li>
<li class="evenrow">HTMLDocumentTest.frameAccessByName [FF3.6]</li>
<li class="oddrow">HTMLDocumentTest.frameAccessByName [IE6]</li>
<li class="evenrow">HTMLDocumentTest.frameAccessByName [IE7]</li>
<li class="oddrow">HTMLDocumentTest.frameAccessByName [IE8]</li>
<li 
class="evenrow">HTMLFormElement2Test.submitWithTargetOnIFrameAndOnload_bubbling_FF
 [FF3.6]</li>
<li 
class="oddrow">HTMLFormElement2Test.submitWithTargetOnIFrameAndOnload_script 
[FF3.6]</li>
<li 
class="evenrow">HTMLFormElement2Test.submitWithTargetOnIFrameAndOnload_attached_IE
 [IE6]</li>
<li 
class="oddrow">HTMLFormElement2Test.submitWithTargetOnIFrameAndOnload_script 
[IE6]</li>
<li 
class="evenrow">HTMLFormElement2Test.submitWithTargetOnIFrameAndOnload_attached_IE
 [IE7]</li>
<li 
class="oddrow">HTMLFormElement2Test.submitWithTargetOnIFrameAndOnload_script 
[IE7]</li>
<li 
class="evenrow">HTMLFormElement2Test.submitWithTargetOnIFrameAndOnload_attached_IE
 [IE8]</li>
<li 
class="oddrow">HTMLFormElement2Test.submitWithTargetOnIFrameAndOnload_script 
[IE8]</li>
<li class="evenrow">HTMLIFrameElement2Test.documentCreateElement_onLoad 
[FF3.6]</li>
<li class="oddrow">HTMLIFrameElement2Test.documentCreateElement_onLoad2 
[FF3.6]</li>
<li class="evenrow">HTMLIFrameElement2Test.documentCreateElement_onLoad2_noSrc 
[FF3.6]</li>
<li class="oddrow">HTMLIFrameElement2Test.documentCreateElement_onLoad3 
[FF3.6]</li>
<li class="evenrow">HTMLIFrameElement2Test.documentCreateElement_onLoad3_noSrc 
[FF3.6]</li>
<li class="oddrow">HTMLIFrameElement2Test.documentCreateElement_onLoad_noSrc 
[FF3.6]</li>
<li 
class="evenrow">HTMLIFrameElement2Test.documentDocumentFragmentCreateElement_onLoad
 [FF3.6]</li>
<li 
class="oddrow">HTMLIFrameElement2Test.documentDocumentFragmentCreateElement_onLoad2
 [FF3.6]</li>
<li 
class="evenrow">HTMLIFrameElement2Test.documentDocumentFragmentCreateElement_onLoad2_noSrc
 [FF3.6]</li>
<li 
class="oddrow">HTMLIFrameElement2Test.documentDocumentFragmentCreateElement_onLoad3
 [FF3.6]</li>
<li 
class="evenrow">HTMLIFrameElement2Test.documentDocumentFragmentCreateElement_onLoad3_noSrc
 [FF3.6]</li>
<li 
class="oddrow">HTMLIFrameElement2Test.documentDocumentFragmentCreateElement_onLoad_noSrc
 [FF3.6]</li>
<li class="evenrow">HTMLIFrameElement2Test.getAlign [FF3.6]</li>
<li class="oddrow">HTMLIFrameElement2Test.setAlign [FF3.6]</li>
<li 
class="evenrow">HTMLIFrameElement2Test.documentDocumentFragmentCreateElement_onLoad2_noSrc
 [IE6]</li>
<li 
class="oddrow">HTMLIFrameElement2Test.documentDocumentFragmentCreateElement_onLoad3_noSrc
 [IE6]</li>
<li 
class="evenrow">HTMLIFrameElement2Test.documentDocumentFragmentCreateElement_onLoad_noSrc
 [IE6]</li>
<li 
class="oddrow">HTMLIFrameElement2Test.documentDocumentFragmentCreateElement_onLoad2_noSrc
 [IE7]</li>
<li 
class="evenrow">HTMLIFrameElement2Test.documentDocumentFragmentCreateElement_onLoad3_noSrc
 [IE7]</li>
<li 
class="oddrow">HTMLIFrameElement2Test.documentDocumentFragmentCreateElement_onLoad_noSrc
 [IE7]</li>
<li 
class="evenrow">HTMLIFrameElement2Test.documentDocumentFragmentCreateElement_onLoad2_noSrc
 [IE8]</li>
<li 
class="oddrow">HTMLIFrameElement2Test.documentDocumentFragmentCreateElement_onLoad3_noSrc
 [IE8]</li>
<li 
class="evenrow">HTMLIFrameElement2Test.documentDocumentFragmentCreateElement_onLoad_noSrc
 [IE8]</li>
<li class="oddrow">HTMLIFrameElementTest.contentDocument [FF3.6]</li>
<li class="evenrow">HTMLIFrameElementTest.frameElement [FF3.6]</li>
<li class="oddrow">HTMLIFrameElementTest.height [FF3.6]</li>
<li class="evenrow">HTMLIFrameElementTest.idByName [FF3.6]</li>
<li class="oddrow">HTMLIFrameElementTest.referenceFromJavaScript [FF3.6]</li>
<li class="evenrow">HTMLIFrameElementTest.width [FF3.6]</li>
<li class="oddrow">HTMLIFrameElementTest.width_px [FF3.6]</li>
<li class="evenrow">HTMLIFrameElementTest.frameElement [IE6]</li>
<li class="oddrow">HTMLIFrameElementTest.height [IE6]</li>
<li class="evenrow">HTMLIFrameElementTest.referenceFromJavaScript [IE6]</li>
<li class="oddrow">HTMLIFrameElementTest.width [IE6]</li>
<li class="evenrow">HTMLIFrameElementTest.width_px [IE6]</li>
<li class="oddrow">HTMLIFrameElementTest.frameElement [IE7]</li>
<li class="evenrow">HTMLIFrameElementTest.height [IE7]</li>
<li class="oddrow">HTMLIFrameElementTest.referenceFromJavaScript [IE7]</li>
<li class="evenrow">HTMLIFrameElementTest.width [IE7]</li>
<li class="oddrow">HTMLIFrameElementTest.width_px [IE7]</li>
<li class="evenrow">HTMLIFrameElementTest.frameElement [IE8]</li>
<li class="oddrow">HTMLIFrameElementTest.height [IE8]</li>
<li class="evenrow">HTMLIFrameElementTest.referenceFromJavaScript [IE8]</li>
<li class="oddrow">HTMLIFrameElementTest.width [IE8]</li>
<li class="evenrow">HTMLIFrameElementTest.width_px [IE8]</li>
<li class="oddrow">XMLDocumentTest.test [FF3.6]</li>
<li class="evenrow">XMLDocumentTest.test [IE6]</li>
<li class="oddrow">XMLDocumentTest.test [IE7]</li>
<li class="evenrow">XMLDocumentTest.test [IE8]</li>
<li class="oddrow">dojo</li>
<li class="evenrow">GWT20Test.dynaTable [IE6]</li>
<li class="oddrow">GWT20Test.dynaTable [IE7]</li>
<li class="evenrow">GWT20Test.dynaTable [IE8]</li>
<li class="oddrow">JQuery126LocalTest.test [FF3.6]</li>
<li class="evenrow">JQuery126LocalTest.test [IE6]</li>
<li class="oddrow">JQuery126LocalTest.test [IE7]</li>
<li class="evenrow">JQuery126Test.test [FF3.6]</li>
<li class="oddrow">JQuery126Test.test [IE6]</li>
<li class="evenrow">JQuery126Test.test [IE7]</li>
<li class="oddrow">JQuery173GitTest.test_15 [FF3.6]</li>
<li class="evenrow">JQuery173GitTest.test_15 [IE6]</li>
<li class="oddrow">JQuery173GitTest.test_15 [IE7]</li>
<li class="evenrow">JQuery173GitTest.test_15 [IE8]</li>
<li class="oddrow">MooTools121Test.mooTools [FF3.6]</li>
<li class="evenrow">MooTools121Test.mooTools [IE6]</li>
<li class="oddrow">MooTools121Test.mooTools [IE7]</li>
<li class="evenrow">MooTools121Test.mooTools [IE8]</li>
<li class="oddrow">Prototype161Test.string [IE8]</li>
</ul>
<h3>Unit Test Error Details: (313)</h3>
<h4>Test: WebClient3Test.readStreamTwice [FF3.6]</h4>
<p>Type:java.lang.ClassCastException</p>
<p>Message:com.gargoylesoftware.htmlunit.html.HtmlUnknownElement cannot be cast 
to com.gargoylesoftware.htmlunit.html.HtmlInlineFrame</p>
<PRE>
</PRE>
<h4>Test: WebClient3Test.readStreamTwice [IE6]</h4>
<p>Type:java.lang.ClassCastException</p>
<p>Message:com.gargoylesoftware.htmlunit.html.HtmlUnknownElement cannot be cast 
to com.gargoylesoftware.htmlunit.html.HtmlInlineFrame</p>
<PRE>
</PRE>
<h4>Test: WebClient3Test.readStreamTwice [IE7]</h4>
<p>Type:java.lang.ClassCastException</p>
<p>Message:com.gargoylesoftware.htmlunit.html.HtmlUnknownElement cannot be cast 
to com.gargoylesoftware.htmlunit.html.HtmlInlineFrame</p>
<PRE>
</PRE>
<h4>Test: WebClient3Test.readStreamTwice [IE8]</h4>
<p>Type:java.lang.ClassCastException</p>
<p>Message:com.gargoylesoftware.htmlunit.html.HtmlUnknownElement cannot be cast 
to com.gargoylesoftware.htmlunit.html.HtmlInlineFrame</p>
<PRE>
</PRE>
<h4>Test: WebClientTest.testHtmlWindowEvents_closedFromFrame [FF3.6]</h4>
<p>Type:java.lang.ClassCastException</p>
<p>Message:com.gargoylesoftware.htmlunit.html.HtmlUnknownElement cannot be cast 
to com.gargoylesoftware.htmlunit.html.HtmlInlineFrame</p>
<PRE>
</PRE>
<h4>Test: WebClientTest.testHtmlWindowEvents_closedFromFrame [IE6]</h4>
<p>Type:java.lang.ClassCastException</p>
<p>Message:com.gargoylesoftware.htmlunit.html.HtmlUnknownElement cannot be cast 
to com.gargoylesoftware.htmlunit.html.HtmlInlineFrame</p>
<PRE>
</PRE>
<h4>Test: WebClientTest.testHtmlWindowEvents_closedFromFrame [IE7]</h4>
<p>Type:java.lang.ClassCastException</p>
<p>Message:com.gargoylesoftware.htmlunit.html.HtmlUnknownElement cannot be cast 
to com.gargoylesoftware.htmlunit.html.HtmlInlineFrame</p>
<PRE>
</PRE>
<h4>Test: WebClientTest.testHtmlWindowEvents_closedFromFrame [IE8]</h4>
<p>Type:java.lang.ClassCastException</p>
<p>Message:com.gargoylesoftware.htmlunit.html.HtmlUnknownElement cannot be cast 
to com.gargoylesoftware.htmlunit.html.HtmlInlineFrame</p>
<PRE>
</PRE>
<h4>Test: BaseFrameElementTest.removeIFrameAndAddAgain [FF3.6]</h4>
<p>Type:java.lang.ClassCastException</p>
<p>Message:com.gargoylesoftware.htmlunit.html.HtmlUnknownElement cannot be cast 
to com.gargoylesoftware.htmlunit.html.BaseFrameElement</p>
<PRE>
</PRE>
<h4>Test: BaseFrameElementTest.removeIFrameAndAddAgain [IE6]</h4>
<p>Type:java.lang.ClassCastException</p>
<p>Message:com.gargoylesoftware.htmlunit.html.HtmlUnknownElement cannot be cast 
to com.gargoylesoftware.htmlunit.html.BaseFrameElement</p>
<PRE>
</PRE>
<h4>Test: BaseFrameElementTest.removeIFrameAndAddAgain [IE7]</h4>
<p>Type:java.lang.ClassCastException</p>
<p>Message:com.gargoylesoftware.htmlunit.html.HtmlUnknownElement cannot be cast 
to com.gargoylesoftware.htmlunit.html.BaseFrameElement</p>
<PRE>
</PRE>
<h4>Test: BaseFrameElementTest.removeIFrameAndAddAgain [IE8]</h4>
<p>Type:java.lang.ClassCastException</p>
<p>Message:com.gargoylesoftware.htmlunit.html.HtmlUnknownElement cannot be cast 
to com.gargoylesoftware.htmlunit.html.BaseFrameElement</p>
<PRE>
</PRE>
<h4>Test: HtmlButtonTest.testReset [FF3.6]</h4>
<p>Type:java.lang.ClassCastException</p>
<p>Message:com.gargoylesoftware.htmlunit.html.HtmlUnknownElement cannot be cast 
to com.gargoylesoftware.htmlunit.html.HtmlIsIndex</p>
<PRE>
</PRE>
<h4>Test: HtmlButtonTest.testReset [IE6]</h4>
<p>Type:java.lang.ClassCastException</p>
<p>Message:com.gargoylesoftware.htmlunit.html.HtmlUnknownElement cannot be cast 
to com.gargoylesoftware.htmlunit.html.HtmlIsIndex</p>
<PRE>
</PRE>
<h4>Test: HtmlButtonTest.testReset [IE7]</h4>
<p>Type:java.lang.ClassCastException</p>
<p>Message:com.gargoylesoftware.htmlunit.html.HtmlUnknownElement cannot be cast 
to com.gargoylesoftware.htmlunit.html.HtmlIsIndex</p>
<PRE>
</PRE>
<h4>Test: HtmlButtonTest.testReset [IE8]</h4>
<p>Type:java.lang.ClassCastException</p>
<p>Message:com.gargoylesoftware.htmlunit.html.HtmlUnknownElement cannot be cast 
to com.gargoylesoftware.htmlunit.html.HtmlIsIndex</p>
<PRE>
</PRE>
<h4>Test: HtmlInlineFrameTest.testFrameSetInnerHtmlDoesLoadFrame [FF3.6]</h4>
<p>Type:java.lang.ClassCastException</p>
<p>Message:com.gargoylesoftware.htmlunit.html.HtmlUnknownElement cannot be cast 
to com.gargoylesoftware.htmlunit.html.HtmlInlineFrame</p>
<PRE>
</PRE>
<h4>Test: HtmlInlineFrameTest.testFrameSetInnerHtmlDoesLoadFrameContentTimeout 
[FF3.6]</h4>
<p>Type:java.lang.ClassCastException</p>
<p>Message:com.gargoylesoftware.htmlunit.html.HtmlUnknownElement cannot be cast 
to com.gargoylesoftware.htmlunit.html.HtmlInlineFrame</p>
<PRE>
</PRE>
<h4>Test: HtmlInlineFrameTest.testFrameWriteDoesNotReloadFrame [FF3.6]</h4>
<p>Type:java.lang.ClassCastException</p>
<p>Message:com.gargoylesoftware.htmlunit.html.HtmlUnknownElement cannot be cast 
to com.gargoylesoftware.htmlunit.html.HtmlInlineFrame</p>
<PRE>
</PRE>
<h4>Test: HtmlInlineFrameTest.testInvalidSrcAttribute [FF3.6]</h4>
<p>Type:java.lang.ClassCastException</p>
<p>Message:com.gargoylesoftware.htmlunit.html.HtmlUnknownElement cannot be cast 
to com.gargoylesoftware.htmlunit.html.HtmlInlineFrame</p>
<PRE>
</PRE>
<h4>Test: HtmlInlineFrameTest.testRecursiveNestedFrames [FF3.6]</h4>
<p>Type:java.lang.ClassCastException</p>
<p>Message:com.gargoylesoftware.htmlunit.html.HtmlUnknownElement cannot be cast 
to com.gargoylesoftware.htmlunit.html.HtmlInlineFrame</p>
<PRE>
</PRE>
<h4>Test: HtmlInlineFrameTest.testRecursiveSrcAttribute [FF3.6]</h4>
<p>Type:java.lang.ClassCastException</p>
<p>Message:com.gargoylesoftware.htmlunit.html.HtmlUnknownElement cannot be cast 
to com.gargoylesoftware.htmlunit.html.HtmlInlineFrame</p>
<PRE>
</PRE>
<h4>Test: HtmlInlineFrameTest.testSetSrcAttribute [FF3.6]</h4>
<p>Type:java.lang.ClassCastException</p>
<p>Message:com.gargoylesoftware.htmlunit.html.HtmlUnknownElement cannot be cast 
to com.gargoylesoftware.htmlunit.html.HtmlInlineFrame</p>
<PRE>
</PRE>
<h4>Test: HtmlInlineFrameTest.testSetSrcAttributeWithWhiteSpaces [FF3.6]</h4>
<p>Type:java.lang.ClassCastException</p>
<p>Message:com.gargoylesoftware.htmlunit.html.HtmlUnknownElement cannot be cast 
to com.gargoylesoftware.htmlunit.html.HtmlInlineFrame</p>
<PRE>
</PRE>
<h4>Test: HtmlInlineFrameTest.testSetSrcAttribute_ViaJavaScript [FF3.6]</h4>
<p>Type:java.lang.ClassCastException</p>
<p>Message:com.gargoylesoftware.htmlunit.html.HtmlUnknownElement cannot be cast 
to com.gargoylesoftware.htmlunit.html.HtmlInlineFrame</p>
<PRE>
</PRE>
<h4>Test: HtmlInlineFrameTest.testFrameSetInnerHtmlDoesLoadFrame [IE6]</h4>
<p>Type:java.lang.ClassCastException</p>
<p>Message:com.gargoylesoftware.htmlunit.html.HtmlUnknownElement cannot be cast 
to com.gargoylesoftware.htmlunit.html.HtmlInlineFrame</p>
<PRE>
</PRE>
<h4>Test: HtmlInlineFrameTest.testFrameSetInnerHtmlDoesLoadFrameContentTimeout 
[IE6]</h4>
<p>Type:java.lang.ClassCastException</p>
<p>Message:com.gargoylesoftware.htmlunit.html.HtmlUnknownElement cannot be cast 
to com.gargoylesoftware.htmlunit.html.HtmlInlineFrame</p>
<PRE>
</PRE>
<h4>Test: HtmlInlineFrameTest.testFrameWriteDoesNotReloadFrame [IE6]</h4>
<p>Type:java.lang.ClassCastException</p>
<p>Message:com.gargoylesoftware.htmlunit.html.HtmlUnknownElement cannot be cast 
to com.gargoylesoftware.htmlunit.html.HtmlInlineFrame</p>
<PRE>
</PRE>
<h4>Test: HtmlInlineFrameTest.testInvalidSrcAttribute [IE6]</h4>
<p>Type:java.lang.ClassCastException</p>
<p>Message:com.gargoylesoftware.htmlunit.html.HtmlUnknownElement cannot be cast 
to com.gargoylesoftware.htmlunit.html.HtmlInlineFrame</p>
<PRE>
</PRE>
<h4>Test: HtmlInlineFrameTest.testRecursiveNestedFrames [IE6]</h4>
<p>Type:java.lang.ClassCastException</p>
<p>Message:com.gargoylesoftware.htmlunit.html.HtmlUnknownElement cannot be cast 
to com.gargoylesoftware.htmlunit.html.HtmlInlineFrame</p>
<PRE>
</PRE>
<h4>Test: HtmlInlineFrameTest.testRecursiveSrcAttribute [IE6]</h4>
<p>Type:java.lang.ClassCastException</p>
<p>Message:com.gargoylesoftware.htmlunit.html.HtmlUnknownElement cannot be cast 
to com.gargoylesoftware.htmlunit.html.HtmlInlineFrame</p>
<PRE>
</PRE>
<h4>Test: HtmlInlineFrameTest.testSetSrcAttribute [IE6]</h4>
<p>Type:java.lang.ClassCastException</p>
<p>Message:com.gargoylesoftware.htmlunit.html.HtmlUnknownElement cannot be cast 
to com.gargoylesoftware.htmlunit.html.HtmlInlineFrame</p>
<PRE>
</PRE>
<h4>Test: HtmlInlineFrameTest.testSetSrcAttributeWithWhiteSpaces [IE6]</h4>
<p>Type:java.lang.ClassCastException</p>
<p>Message:com.gargoylesoftware.htmlunit.html.HtmlUnknownElement cannot be cast 
to com.gargoylesoftware.htmlunit.html.HtmlInlineFrame</p>
<PRE>
</PRE>
<h4>Test: HtmlInlineFrameTest.testSetSrcAttribute_ViaJavaScript [IE6]</h4>
<p>Type:java.lang.ClassCastException</p>
<p>Message:com.gargoylesoftware.htmlunit.html.HtmlUnknownElement cannot be cast 
to com.gargoylesoftware.htmlunit.html.HtmlInlineFrame</p>
<PRE>
</PRE>
<h4>Test: HtmlInlineFrameTest.testFrameSetInnerHtmlDoesLoadFrame [IE7]</h4>
<p>Type:java.lang.ClassCastException</p>
<p>Message:com.gargoylesoftware.htmlunit.html.HtmlUnknownElement cannot be cast 
to com.gargoylesoftware.htmlunit.html.HtmlInlineFrame</p>
<PRE>
</PRE>
<h4>Test: HtmlInlineFrameTest.testFrameSetInnerHtmlDoesLoadFrameContentTimeout 
[IE7]</h4>
<p>Type:java.lang.ClassCastException</p>
<p>Message:com.gargoylesoftware.htmlunit.html.HtmlUnknownElement cannot be cast 
to com.gargoylesoftware.htmlunit.html.HtmlInlineFrame</p>
<PRE>
</PRE>
<h4>Test: HtmlInlineFrameTest.testFrameWriteDoesNotReloadFrame [IE7]</h4>
<p>Type:java.lang.ClassCastException</p>
<p>Message:com.gargoylesoftware.htmlunit.html.HtmlUnknownElement cannot be cast 
to com.gargoylesoftware.htmlunit.html.HtmlInlineFrame</p>
<PRE>
</PRE>
<h4>Test: HtmlInlineFrameTest.testInvalidSrcAttribute [IE7]</h4>
<p>Type:java.lang.ClassCastException</p>
<p>Message:com.gargoylesoftware.htmlunit.html.HtmlUnknownElement cannot be cast 
to com.gargoylesoftware.htmlunit.html.HtmlInlineFrame</p>
<PRE>
</PRE>
<h4>Test: HtmlInlineFrameTest.testRecursiveNestedFrames [IE7]</h4>
<p>Type:java.lang.ClassCastException</p>
<p>Message:com.gargoylesoftware.htmlunit.html.HtmlUnknownElement cannot be cast 
to com.gargoylesoftware.htmlunit.html.HtmlInlineFrame</p>
<PRE>
</PRE>
<h4>Test: HtmlInlineFrameTest.testRecursiveSrcAttribute [IE7]</h4>
<p>Type:java.lang.ClassCastException</p>
<p>Message:com.gargoylesoftware.htmlunit.html.HtmlUnknownElement cannot be cast 
to com.gargoylesoftware.htmlunit.html.HtmlInlineFrame</p>
<PRE>
</PRE>
<h4>Test: HtmlInlineFrameTest.testSetSrcAttribute [IE7]</h4>
<p>Type:java.lang.ClassCastException</p>
<p>Message:com.gargoylesoftware.htmlunit.html.HtmlUnknownElement cannot be cast 
to com.gargoylesoftware.htmlunit.html.HtmlInlineFrame</p>
<PRE>
</PRE>
<h4>Test: HtmlInlineFrameTest.testSetSrcAttributeWithWhiteSpaces [IE7]</h4>
<p>Type:java.lang.ClassCastException</p>
<p>Message:com.gargoylesoftware.htmlunit.html.HtmlUnknownElement cannot be cast 
to com.gargoylesoftware.htmlunit.html.HtmlInlineFrame</p>
<PRE>
</PRE>
<h4>Test: HtmlInlineFrameTest.testSetSrcAttribute_ViaJavaScript [IE7]</h4>
<p>Type:java.lang.ClassCastException</p>
<p>Message:com.gargoylesoftware.htmlunit.html.HtmlUnknownElement cannot be cast 
to com.gargoylesoftware.htmlunit.html.HtmlInlineFrame</p>
<PRE>
</PRE>
<h4>Test: HtmlInlineFrameTest.testFrameSetInnerHtmlDoesLoadFrame [IE8]</h4>
<p>Type:java.lang.ClassCastException</p>
<p>Message:com.gargoylesoftware.htmlunit.html.HtmlUnknownElement cannot be cast 
to com.gargoylesoftware.htmlunit.html.HtmlInlineFrame</p>
<PRE>
</PRE>
<h4>Test: HtmlInlineFrameTest.testFrameSetInnerHtmlDoesLoadFrameContentTimeout 
[IE8]</h4>
<p>Type:java.lang.ClassCastException</p>
<p>Message:com.gargoylesoftware.htmlunit.html.HtmlUnknownElement cannot be cast 
to com.gargoylesoftware.htmlunit.html.HtmlInlineFrame</p>
<PRE>
</PRE>
<h4>Test: HtmlInlineFrameTest.testFrameWriteDoesNotReloadFrame [IE8]</h4>
<p>Type:java.lang.ClassCastException</p>
<p>Message:com.gargoylesoftware.htmlunit.html.HtmlUnknownElement cannot be cast 
to com.gargoylesoftware.htmlunit.html.HtmlInlineFrame</p>
<PRE>
</PRE>
<h4>Test: HtmlInlineFrameTest.testInvalidSrcAttribute [IE8]</h4>
<p>Type:java.lang.ClassCastException</p>
<p>Message:com.gargoylesoftware.htmlunit.html.HtmlUnknownElement cannot be cast 
to com.gargoylesoftware.htmlunit.html.HtmlInlineFrame</p>
<PRE>
</PRE>
<h4>Test: HtmlInlineFrameTest.testRecursiveNestedFrames [IE8]</h4>
<p>Type:java.lang.ClassCastException</p>
<p>Message:com.gargoylesoftware.htmlunit.html.HtmlUnknownElement cannot be cast 
to com.gargoylesoftware.htmlunit.html.HtmlInlineFrame</p>
<PRE>
</PRE>
<h4>Test: HtmlInlineFrameTest.testRecursiveSrcAttribute [IE8]</h4>
<p>Type:java.lang.ClassCastException</p>
<p>Message:com.gargoylesoftware.htmlunit.html.HtmlUnknownElement cannot be cast 
to com.gargoylesoftware.htmlunit.html.HtmlInlineFrame</p>
<PRE>
</PRE>
<h4>Test: HtmlInlineFrameTest.testSetSrcAttribute [IE8]</h4>
<p>Type:java.lang.ClassCastException</p>
<p>Message:com.gargoylesoftware.htmlunit.html.HtmlUnknownElement cannot be cast 
to com.gargoylesoftware.htmlunit.html.HtmlInlineFrame</p>
<PRE>
</PRE>
<h4>Test: HtmlInlineFrameTest.testSetSrcAttributeWithWhiteSpaces [IE8]</h4>
<p>Type:java.lang.ClassCastException</p>
<p>Message:com.gargoylesoftware.htmlunit.html.HtmlUnknownElement cannot be cast 
to com.gargoylesoftware.htmlunit.html.HtmlInlineFrame</p>
<PRE>
</PRE>
<h4>Test: HtmlInlineFrameTest.testSetSrcAttribute_ViaJavaScript [IE8]</h4>
<p>Type:java.lang.ClassCastException</p>
<p>Message:com.gargoylesoftware.htmlunit.html.HtmlUnknownElement cannot be cast 
to com.gargoylesoftware.htmlunit.html.HtmlInlineFrame</p>
<PRE>
</PRE>
<h4>Test: HtmlIsIndexTest.testFormSubmission [FF3.6]</h4>
<p>Type:java.lang.ClassCastException</p>
<p>Message:com.gargoylesoftware.htmlunit.html.HtmlUnknownElement cannot be cast 
to com.gargoylesoftware.htmlunit.html.HtmlIsIndex</p>
<PRE>
</PRE>
<h4>Test: HtmlIsIndexTest.testFormSubmission [IE6]</h4>
<p>Type:java.lang.ClassCastException</p>
<p>Message:com.gargoylesoftware.htmlunit.html.HtmlUnknownElement cannot be cast 
to com.gargoylesoftware.htmlunit.html.HtmlIsIndex</p>
<PRE>
</PRE>
<h4>Test: HtmlIsIndexTest.testFormSubmission [IE7]</h4>
<p>Type:java.lang.ClassCastException</p>
<p>Message:com.gargoylesoftware.htmlunit.html.HtmlUnknownElement cannot be cast 
to com.gargoylesoftware.htmlunit.html.HtmlIsIndex</p>
<PRE>
</PRE>
<h4>Test: HtmlIsIndexTest.testFormSubmission [IE8]</h4>
<p>Type:java.lang.ClassCastException</p>
<p>Message:com.gargoylesoftware.htmlunit.html.HtmlUnknownElement cannot be cast 
to com.gargoylesoftware.htmlunit.html.HtmlIsIndex</p>
<PRE>
</PRE>
<h4>Test: HtmlPageTest.testNoSlashURL [FF3.6]</h4>
<p>Type:java.lang.ClassCastException</p>
<p>Message:com.gargoylesoftware.htmlunit.html.HtmlUnknownElement cannot be cast 
to com.gargoylesoftware.htmlunit.html.HtmlInlineFrame</p>
<PRE>
</PRE>
<h4>Test: HtmlResetInputTest.reset [FF3.6]</h4>
<p>Type:java.lang.ClassCastException</p>
<p>Message:com.gargoylesoftware.htmlunit.html.HtmlUnknownElement cannot be cast 
to com.gargoylesoftware.htmlunit.html.HtmlIsIndex</p>
<PRE>
</PRE>
<h4>Test: HtmlResetInputTest.reset [IE6]</h4>
<p>Type:java.lang.ClassCastException</p>
<p>Message:com.gargoylesoftware.htmlunit.html.HtmlUnknownElement cannot be cast 
to com.gargoylesoftware.htmlunit.html.HtmlIsIndex</p>
<PRE>
</PRE>
<h4>Test: HtmlResetInputTest.reset [IE7]</h4>
<p>Type:java.lang.ClassCastException</p>
<p>Message:com.gargoylesoftware.htmlunit.html.HtmlUnknownElement cannot be cast 
to com.gargoylesoftware.htmlunit.html.HtmlIsIndex</p>
<PRE>
</PRE>
<h4>Test: HtmlResetInputTest.reset [IE8]</h4>
<p>Type:java.lang.ClassCastException</p>
<p>Message:com.gargoylesoftware.htmlunit.html.HtmlUnknownElement cannot be cast 
to com.gargoylesoftware.htmlunit.html.HtmlIsIndex</p>
<PRE>
</PRE>
<h4>Test: JavaScriptEngine2Test.jsRunSingleThreadedBrowserWide [FF3.6]</h4>
<p>Type:org.openqa.selenium.WebDriverException</p>
<p>Message:com.gargoylesoftware.htmlunit.ScriptException: TypeError: Cannot 
call method "setTimeout" of undefined (script in http://localhost:12345/ from 
(1, 21) to (26, 10)#22) Build info: version: '2.25.0', revision: '17482', time: 
'2012-07-18 22:18:01' System info: os.name: 'Linux', os.arch: 'i386', 
os.version: '2.6.26.3', java.version: '1.6.0_33' Driver info: driver.version: 
HtmlUnitDriver</p>
<PRE>
</PRE>
<h4>Test: JavaScriptEngine2Test.jsRunSingleThreadedBrowserWide [IE6]</h4>
<p>Type:org.openqa.selenium.WebDriverException</p>
<p>Message:com.gargoylesoftware.htmlunit.ScriptException: TypeError: Cannot 
call method "setTimeout" of undefined (script in http://localhost:12345/ from 
(1, 21) to (26, 10)#22) Build info: version: '2.25.0', revision: '17482', time: 
'2012-07-18 22:18:01' System info: os.name: 'Linux', os.arch: 'i386', 
os.version: '2.6.26.3', java.version: '1.6.0_33' Driver info: driver.version: 
HtmlUnitDriver</p>
<PRE>
</PRE>
<h4>Test: JavaScriptEngine2Test.jsRunSingleThreadedBrowserWide [IE7]</h4>
<p>Type:org.openqa.selenium.WebDriverException</p>
<p>Message:com.gargoylesoftware.htmlunit.ScriptException: TypeError: Cannot 
call method "setTimeout" of undefined (script in http://localhost:12345/ from 
(1, 21) to (26, 10)#22) Build info: version: '2.25.0', revision: '17482', time: 
'2012-07-18 22:18:01' System info: os.name: 'Linux', os.arch: 'i386', 
os.version: '2.6.26.3', java.version: '1.6.0_33' Driver info: driver.version: 
HtmlUnitDriver</p>
<PRE>
</PRE>
<h4>Test: JavaScriptEngine2Test.jsRunSingleThreadedBrowserWide [IE8]</h4>
<p>Type:org.openqa.selenium.WebDriverException</p>
<p>Message:com.gargoylesoftware.htmlunit.ScriptException: TypeError: Cannot 
call method "setTimeout" of undefined (script in http://localhost:12345/ from 
(1, 21) to (26, 10)#22) Build info: version: '2.25.0', revision: '17482', time: 
'2012-07-18 22:18:01' System info: os.name: 'Linux', os.arch: 'i386', 
os.version: '2.6.26.3', java.version: '1.6.0_33' Driver info: driver.version: 
HtmlUnitDriver</p>
<PRE>
</PRE>
<h4>Test: PostponedActionTest.loadingJavaScript2 [FF3.6]</h4>
<p>Type:org.openqa.selenium.WebDriverException</p>
<p>Message:com.gargoylesoftware.htmlunit.ScriptException: TypeError: Cannot 
read property "location" from undefined (script in http://localhost:12345/ from 
(3, 9) to (11, 10)#8) Build info: version: '2.25.0', revision: '17482', time: 
'2012-07-18 22:18:01' System info: os.name: 'Linux', os.arch: 'i386', 
os.version: '2.6.26.3', java.version: '1.6.0_33' Driver info: driver.version: 
HtmlUnitDriver</p>
<PRE>
</PRE>
<h4>Test: PostponedActionTest.loadingJavaScript2 [IE6]</h4>
<p>Type:org.openqa.selenium.WebDriverException</p>
<p>Message:com.gargoylesoftware.htmlunit.ScriptException: TypeError: Cannot 
read property "location" from undefined (script in http://localhost:12345/ from 
(3, 9) to (11, 10)#8) Build info: version: '2.25.0', revision: '17482', time: 
'2012-07-18 22:18:01' System info: os.name: 'Linux', os.arch: 'i386', 
os.version: '2.6.26.3', java.version: '1.6.0_33' Driver info: driver.version: 
HtmlUnitDriver</p>
<PRE>
</PRE>
<h4>Test: PostponedActionTest.loadingJavaScript2 [IE7]</h4>
<p>Type:org.openqa.selenium.WebDriverException</p>
<p>Message:com.gargoylesoftware.htmlunit.ScriptException: TypeError: Cannot 
read property "location" from undefined (script in http://localhost:12345/ from 
(3, 9) to (11, 10)#8) Build info: version: '2.25.0', revision: '17482', time: 
'2012-07-18 22:18:01' System info: os.name: 'Linux', os.arch: 'i386', 
os.version: '2.6.26.3', java.version: '1.6.0_33' Driver info: driver.version: 
HtmlUnitDriver</p>
<PRE>
</PRE>
<h4>Test: PostponedActionTest.loadingJavaScript2 [IE8]</h4>
<p>Type:org.openqa.selenium.WebDriverException</p>
<p>Message:com.gargoylesoftware.htmlunit.ScriptException: TypeError: Cannot 
read property "location" from undefined (script in http://localhost:12345/ from 
(3, 9) to (11, 10)#8) Build info: version: '2.25.0', revision: '17482', time: 
'2012-07-18 22:18:01' System info: os.name: 'Linux', os.arch: 'i386', 
os.version: '2.6.26.3', java.version: '1.6.0_33' Driver info: driver.version: 
HtmlUnitDriver</p>
<PRE>
</PRE>
<h4>Test: JavaScriptJobManagerTest.navigationStopThreadsInChildWindows 
[FF3.6]</h4>
<p>Type:java.lang.ClassCastException</p>
<p>Message:com.gargoylesoftware.htmlunit.html.HtmlUnknownElement cannot be cast 
to com.gargoylesoftware.htmlunit.html.HtmlInlineFrame</p>
<PRE>
</PRE>
<h4>Test: JavaScriptJobManagerTest.navigationStopThreadsInChildWindows 
[IE6]</h4>
<p>Type:java.lang.ClassCastException</p>
<p>Message:com.gargoylesoftware.htmlunit.html.HtmlUnknownElement cannot be cast 
to com.gargoylesoftware.htmlunit.html.HtmlInlineFrame</p>
<PRE>
</PRE>
<h4>Test: JavaScriptJobManagerTest.navigationStopThreadsInChildWindows 
[IE7]</h4>
<p>Type:java.lang.ClassCastException</p>
<p>Message:com.gargoylesoftware.htmlunit.html.HtmlUnknownElement cannot be cast 
to com.gargoylesoftware.htmlunit.html.HtmlInlineFrame</p>
<PRE>
</PRE>
<h4>Test: JavaScriptJobManagerTest.navigationStopThreadsInChildWindows 
[IE8]</h4>
<p>Type:java.lang.ClassCastException</p>
<p>Message:com.gargoylesoftware.htmlunit.html.HtmlUnknownElement cannot be cast 
to com.gargoylesoftware.htmlunit.html.HtmlInlineFrame</p>
<PRE>
</PRE>
<h4>Test: DocumentTest.noBodyTag_IFrame [FF3.6]</h4>
<p>Type:======= EXCEPTION START ======== EcmaError</p>
<p>Message:TypeError: Cannot read property "document" from undefined (script in 
http://localhost:12345/ from (7, 13) to (12, 14)#8)</p>
<PRE>
</PRE>
<h4>Test: DocumentTest.noBodyTag_IFrame [IE6]</h4>
<p>Type:======= EXCEPTION START ======== EcmaError</p>
<p>Message:TypeError: Cannot read property "document" from undefined (script in 
http://localhost:12345/ from (7, 13) to (12, 14)#8)</p>
<PRE>
</PRE>
<h4>Test: DocumentTest.noBodyTag_IFrame [IE7]</h4>
<p>Type:======= EXCEPTION START ======== EcmaError</p>
<p>Message:TypeError: Cannot read property "document" from undefined (script in 
http://localhost:12345/ from (7, 13) to (12, 14)#8)</p>
<PRE>
</PRE>
<h4>Test: DocumentTest.noBodyTag_IFrame [IE8]</h4>
<p>Type:======= EXCEPTION START ======== EcmaError</p>
<p>Message:TypeError: Cannot read property "document" from undefined (script in 
http://localhost:12345/ from (7, 13) to (12, 14)#8)</p>
<PRE>
</PRE>
<h4>Test: Location2Test.about_blank_attributes [FF3.6]</h4>
<p>Type:org.openqa.selenium.WebDriverException</p>
<p>Message:com.gargoylesoftware.htmlunit.ScriptException: TypeError: Cannot 
read property "document" from undefined (script in http://localhost:12345/ from 
(1, 41) to (11, 10)#3) Build info: version: '2.25.0', revision: '17482', time: 
'2012-07-18 22:18:01' System info: os.name: 'Linux', os.arch: 'i386', 
os.version: '2.6.26.3', java.version: '1.6.0_33' Driver info: driver.version: 
HtmlUnitDriver</p>
<PRE>
</PRE>
<h4>Test: Location2Test.about_blank_attributes [IE6]</h4>
<p>Type:org.openqa.selenium.WebDriverException</p>
<p>Message:com.gargoylesoftware.htmlunit.ScriptException: TypeError: Cannot 
read property "document" from undefined (script in http://localhost:12345/ from 
(1, 41) to (11, 10)#3) Build info: version: '2.25.0', revision: '17482', time: 
'2012-07-18 22:18:01' System info: os.name: 'Linux', os.arch: 'i386', 
os.version: '2.6.26.3', java.version: '1.6.0_33' Driver info: driver.version: 
HtmlUnitDriver</p>
<PRE>
</PRE>
<h4>Test: Location2Test.about_blank_attributes [IE7]</h4>
<p>Type:org.openqa.selenium.WebDriverException</p>
<p>Message:com.gargoylesoftware.htmlunit.ScriptException: TypeError: Cannot 
read property "document" from undefined (script in http://localhost:12345/ from 
(1, 41) to (11, 10)#3) Build info: version: '2.25.0', revision: '17482', time: 
'2012-07-18 22:18:01' System info: os.name: 'Linux', os.arch: 'i386', 
os.version: '2.6.26.3', java.version: '1.6.0_33' Driver info: driver.version: 
HtmlUnitDriver</p>
<PRE>
</PRE>
<h4>Test: Location2Test.about_blank_attributes [IE8]</h4>
<p>Type:org.openqa.selenium.WebDriverException</p>
<p>Message:com.gargoylesoftware.htmlunit.ScriptException: TypeError: Cannot 
read property "document" from undefined (script in http://localhost:12345/ from 
(1, 41) to (11, 10)#3) Build info: version: '2.25.0', revision: '17482', time: 
'2012-07-18 22:18:01' System info: os.name: 'Linux', os.arch: 'i386', 
os.version: '2.6.26.3', java.version: '1.6.0_33' Driver info: driver.version: 
HtmlUnitDriver</p>
<PRE>
</PRE>
<h4>Test: Node2Test.event [FF3.6]</h4>
<p>Type:======= EXCEPTION START ======== EcmaError</p>
<p>Message:TypeError: Cannot read property "location" from undefined (script in 
http://localhost:12345/ from (3, 9) to (9, 10)#7)</p>
<PRE>
</PRE>
<h4>Test: Node2Test.event [IE6]</h4>
<p>Type:======= EXCEPTION START ======== EcmaError</p>
<p>Message:TypeError: Cannot read property "location" from undefined (script in 
http://localhost:12345/ from (3, 9) to (9, 10)#7)</p>
<PRE>
</PRE>
<h4>Test: Node2Test.event [IE7]</h4>
<p>Type:======= EXCEPTION START ======== EcmaError</p>
<p>Message:TypeError: Cannot read property "location" from undefined (script in 
http://localhost:12345/ from (3, 9) to (9, 10)#7)</p>
<PRE>
</PRE>
<h4>Test: Node2Test.event [IE8]</h4>
<p>Type:======= EXCEPTION START ======== EcmaError</p>
<p>Message:TypeError: Cannot read property "location" from undefined (script in 
http://localhost:12345/ from (3, 9) to (9, 10)#7)</p>
<PRE>
</PRE>
<h4>Test: SelectionTest.getSelection_display [FF3.6]</h4>
<p>Type:org.openqa.selenium.WebDriverException</p>
<p>Message:com.gargoylesoftware.htmlunit.ScriptException: TypeError: Cannot 
call method "getSelection" of undefined (script in http://localhost:12345/ from 
(5, 9) to (9, 10)#8) Build info: version: '2.25.0', revision: '17482', time: 
'2012-07-18 22:18:01' System info: os.name: 'Linux', os.arch: 'i386', 
os.version: '2.6.26.3', java.version: '1.6.0_33' Driver info: driver.version: 
HtmlUnitDriver</p>
<PRE>
</PRE>
<h4>Test: setTimeoutOnFrameWindow</h4>
<p>Type:======= EXCEPTION START ======== EcmaError</p>
<p>Message:TypeError: Cannot call method "setTimeout" of undefined (script in 
http://localhost:12345/ from (1, 39) to (8, 10)#3)</p>
<PRE>
</PRE>
<h4>Test: WindowTest.openWindow_blank [FF3.6]</h4>
<p>Type:java.lang.ClassCastException</p>
<p>Message:com.gargoylesoftware.htmlunit.html.HtmlUnknownElement cannot be cast 
to com.gargoylesoftware.htmlunit.html.HtmlInlineFrame</p>
<PRE>
</PRE>
<h4>Test: WindowTest.openWindow_parent [FF3.6]</h4>
<p>Type:java.lang.ClassCastException</p>
<p>Message:com.gargoylesoftware.htmlunit.html.HtmlUnknownElement cannot be cast 
to com.gargoylesoftware.htmlunit.html.HtmlInlineFrame</p>
<PRE>
</PRE>
<h4>Test: WindowTest.openWindow_top [FF3.6]</h4>
<p>Type:java.lang.ClassCastException</p>
<p>Message:com.gargoylesoftware.htmlunit.html.HtmlUnknownElement cannot be cast 
to com.gargoylesoftware.htmlunit.html.HtmlInlineFrame</p>
<PRE>
</PRE>
<h4>Test: WindowTest.openWindow_blank [IE6]</h4>
<p>Type:java.lang.ClassCastException</p>
<p>Message:com.gargoylesoftware.htmlunit.html.HtmlUnknownElement cannot be cast 
to com.gargoylesoftware.htmlunit.html.HtmlInlineFrame</p>
<PRE>
</PRE>
<h4>Test: WindowTest.openWindow_parent [IE6]</h4>
<p>Type:java.lang.ClassCastException</p>
<p>Message:com.gargoylesoftware.htmlunit.html.HtmlUnknownElement cannot be cast 
to com.gargoylesoftware.htmlunit.html.HtmlInlineFrame</p>
<PRE>
</PRE>
<h4>Test: WindowTest.openWindow_top [IE6]</h4>
<p>Type:java.lang.ClassCastException</p>
<p>Message:com.gargoylesoftware.htmlunit.html.HtmlUnknownElement cannot be cast 
to com.gargoylesoftware.htmlunit.html.HtmlInlineFrame</p>
<PRE>
</PRE>
<h4>Test: WindowTest.openWindow_blank [IE7]</h4>
<p>Type:java.lang.ClassCastException</p>
<p>Message:com.gargoylesoftware.htmlunit.html.HtmlUnknownElement cannot be cast 
to com.gargoylesoftware.htmlunit.html.HtmlInlineFrame</p>
<PRE>
</PRE>
<h4>Test: WindowTest.openWindow_parent [IE7]</h4>
<p>Type:java.lang.ClassCastException</p>
<p>Message:com.gargoylesoftware.htmlunit.html.HtmlUnknownElement cannot be cast 
to com.gargoylesoftware.htmlunit.html.HtmlInlineFrame</p>
<PRE>
</PRE>
<h4>Test: WindowTest.openWindow_top [IE7]</h4>
<p>Type:java.lang.ClassCastException</p>
<p>Message:com.gargoylesoftware.htmlunit.html.HtmlUnknownElement cannot be cast 
to com.gargoylesoftware.htmlunit.html.HtmlInlineFrame</p>
<PRE>
</PRE>
<h4>Test: WindowTest.openWindow_blank [IE8]</h4>
<p>Type:java.lang.ClassCastException</p>
<p>Message:com.gargoylesoftware.htmlunit.html.HtmlUnknownElement cannot be cast 
to com.gargoylesoftware.htmlunit.html.HtmlInlineFrame</p>
<PRE>
</PRE>
<h4>Test: WindowTest.openWindow_parent [IE8]</h4>
<p>Type:java.lang.ClassCastException</p>
<p>Message:com.gargoylesoftware.htmlunit.html.HtmlUnknownElement cannot be cast 
to com.gargoylesoftware.htmlunit.html.HtmlInlineFrame</p>
<PRE>
</PRE>
<h4>Test: WindowTest.openWindow_top [IE8]</h4>
<p>Type:java.lang.ClassCastException</p>
<p>Message:com.gargoylesoftware.htmlunit.html.HtmlUnknownElement cannot be cast 
to com.gargoylesoftware.htmlunit.html.HtmlInlineFrame</p>
<PRE>
</PRE>
<h4>Test: HTMLDocument2Test.domain_set_for_about_blank [FF3.6]</h4>
<p>Type:======= EXCEPTION START ======== EcmaError</p>
<p>Message:TypeError: Cannot read property "document" from undefined (script in 
http://www.gargoylesoftware.com/ from (1, 39) to (11, 10)#5)</p>
<PRE>
</PRE>
<h4>Test: HTMLDocument2Test.readyState [FF3.6]</h4>
<p>Type:======= EXCEPTION START ======== EcmaError</p>
<p>Message:TypeError: Cannot read property "document" from undefined (script in 
http://localhost:12345/ from (3, 13) to (16, 14)#8)</p>
<PRE>
</PRE>
<h4>Test: HTMLDocument2Test.domain_set_for_about_blank [IE6]</h4>
<p>Type:======= EXCEPTION START ======== EcmaError</p>
<p>Message:TypeError: Cannot read property "document" from undefined (script in 
http://www.gargoylesoftware.com/ from (1, 39) to (11, 10)#5)</p>
<PRE>
</PRE>
<h4>Test: HTMLDocument2Test.domain_set_for_about_blank [IE7]</h4>
<p>Type:======= EXCEPTION START ======== EcmaError</p>
<p>Message:TypeError: Cannot read property "document" from undefined (script in 
http://www.gargoylesoftware.com/ from (1, 39) to (11, 10)#5)</p>
<PRE>
</PRE>
<h4>Test: HTMLDocument2Test.domain_set_for_about_blank [IE8]</h4>
<p>Type:======= EXCEPTION START ======== EcmaError</p>
<p>Message:TypeError: Cannot read property "document" from undefined (script in 
http://www.gargoylesoftware.com/ from (1, 39) to (11, 10)#5)</p>
<PRE>
</PRE>
<h4>Test: HTMLDocumentTest.frames [IE6]</h4>
<p>Type:org.openqa.selenium.WebDriverException</p>
<p>Message:com.gargoylesoftware.htmlunit.ScriptException: TypeError: Cannot 
read property "location" from undefined (script in http://localhost:12345/ from 
(1, 21) to (13, 10)#7) Build info: version: '2.25.0', revision: '17482', time: 
'2012-07-18 22:18:01' System info: os.name: 'Linux', os.arch: 'i386', 
os.version: '2.6.26.3', java.version: '1.6.0_33' Driver info: driver.version: 
HtmlUnitDriver</p>
<PRE>
</PRE>
<h4>Test: HTMLDocumentTest.frames [IE7]</h4>
<p>Type:org.openqa.selenium.WebDriverException</p>
<p>Message:com.gargoylesoftware.htmlunit.ScriptException: TypeError: Cannot 
read property "location" from undefined (script in http://localhost:12345/ from 
(1, 21) to (13, 10)#7) Build info: version: '2.25.0', revision: '17482', time: 
'2012-07-18 22:18:01' System info: os.name: 'Linux', os.arch: 'i386', 
os.version: '2.6.26.3', java.version: '1.6.0_33' Driver info: driver.version: 
HtmlUnitDriver</p>
<PRE>
</PRE>
<h4>Test: HTMLDocumentTest.frames [IE8]</h4>
<p>Type:org.openqa.selenium.WebDriverException</p>
<p>Message:com.gargoylesoftware.htmlunit.ScriptException: TypeError: Cannot 
read property "location" from undefined (script in http://localhost:12345/ from 
(1, 21) to (13, 10)#7) Build info: version: '2.25.0', revision: '17482', time: 
'2012-07-18 22:18:01' System info: os.name: 'Linux', os.arch: 'i386', 
os.version: '2.6.26.3', java.version: '1.6.0_33' Driver info: driver.version: 
HtmlUnitDriver</p>
<PRE>
</PRE>
<h4>Test: HTMLDocumentWrite2Test.writeInFrameWithOnload [FF3.6]</h4>
<p>Type:org.openqa.selenium.WebDriverException</p>
<p>Message:com.gargoylesoftware.htmlunit.ScriptException: TypeError: Cannot 
read property "document" from undefined (script in http://localhost:12345/ from 
(4, 9) to (11, 10)#5) Build info: version: '2.25.0', revision: '17482', time: 
'2012-07-18 22:18:01' System info: os.name: 'Linux', os.arch: 'i386', 
os.version: '2.6.26.3', java.version: '1.6.0_33' Driver info: driver.version: 
HtmlUnitDriver</p>
<PRE>
</PRE>
<h4>Test: HTMLDocumentWrite2Test.writeInFrameWithOnload [IE6]</h4>
<p>Type:org.openqa.selenium.WebDriverException</p>
<p>Message:com.gargoylesoftware.htmlunit.ScriptException: TypeError: Cannot 
read property "document" from undefined (script in http://localhost:12345/ from 
(4, 9) to (11, 10)#5) Build info: version: '2.25.0', revision: '17482', time: 
'2012-07-18 22:18:01' System info: os.name: 'Linux', os.arch: 'i386', 
os.version: '2.6.26.3', java.version: '1.6.0_33' Driver info: driver.version: 
HtmlUnitDriver</p>
<PRE>
</PRE>
<h4>Test: HTMLDocumentWrite2Test.writeInFrameWithOnload [IE7]</h4>
<p>Type:org.openqa.selenium.WebDriverException</p>
<p>Message:com.gargoylesoftware.htmlunit.ScriptException: TypeError: Cannot 
read property "document" from undefined (script in http://localhost:12345/ from 
(4, 9) to (11, 10)#5) Build info: version: '2.25.0', revision: '17482', time: 
'2012-07-18 22:18:01' System info: os.name: 'Linux', os.arch: 'i386', 
os.version: '2.6.26.3', java.version: '1.6.0_33' Driver info: driver.version: 
HtmlUnitDriver</p>
<PRE>
</PRE>
<h4>Test: HTMLDocumentWrite2Test.writeInFrameWithOnload [IE8]</h4>
<p>Type:org.openqa.selenium.WebDriverException</p>
<p>Message:com.gargoylesoftware.htmlunit.ScriptException: TypeError: Cannot 
read property "document" from undefined (script in http://localhost:12345/ from 
(4, 9) to (11, 10)#5) Build info: version: '2.25.0', revision: '17482', time: 
'2012-07-18 22:18:01' System info: os.name: 'Linux', os.arch: 'i386', 
os.version: '2.6.26.3', java.version: '1.6.0_33' Driver info: driver.version: 
HtmlUnitDriver</p>
<PRE>
</PRE>
<h4>Test: HTMLDocumentWriteTest.write_script [FF3.6]</h4>
<p>Type:java.lang.IllegalStateException</p>
<p>Message:No response specified that can handle URL [http://first/]</p>
<PRE>
</PRE>
<h4>Test: HTMLDocumentWriteTest.write_script [IE6]</h4>
<p>Type:java.lang.IllegalStateException</p>
<p>Message:No response specified that can handle URL [http://first/]</p>
<PRE>
</PRE>
<h4>Test: HTMLDocumentWriteTest.write_script [IE7]</h4>
<p>Type:java.lang.IllegalStateException</p>
<p>Message:No response specified that can handle URL [http://first/]</p>
<PRE>
</PRE>
<h4>Test: HTMLDocumentWriteTest.write_script [IE8]</h4>
<p>Type:java.lang.IllegalStateException</p>
<p>Message:No response specified that can handle URL [http://first/]</p>
<PRE>
</PRE>
<h4>Test: HTMLIFrameElementTest.onLoadCalledEachTimeFrameContentChanges 
[FF3.6]</h4>
<p>Type:======= EXCEPTION START ======== EcmaError</p>
<p>Message:TypeError: Cannot read property "location" from undefined</p>
<PRE>
</PRE>
<h4>Test: HTMLIFrameElementTest.readyState_IFrame [FF3.6]</h4>
<p>Type:======= EXCEPTION START ======== EcmaError</p>
<p>Message:TypeError: Cannot read property "document" from undefined (script in 
http://localhost:12345/ from (4, 13) to (9, 14)#5)</p>
<PRE>
</PRE>
<h4>Test: HTMLIFrameElementTest.setSrcAttribute [FF3.6]</h4>
<p>Type:java.lang.ClassCastException</p>
<p>Message:com.gargoylesoftware.htmlunit.html.HtmlUnknownElement cannot be cast 
to com.gargoylesoftware.htmlunit.html.HtmlInlineFrame</p>
<PRE>
</PRE>
<h4>Test: HTMLIFrameElementTest.setSrc_JavascriptUrl [FF3.6]</h4>
<p>Type:======= EXCEPTION START ======== EcmaError</p>
<p>Message:TypeError: Cannot read property "location" from undefined (script in 
http://localhost:12345/ from (1, 41) to (6, 10)#4)</p>
<PRE>
</PRE>
<h4>Test: HTMLIFrameElementTest.settingInnerHtmlTriggersFrameLoad [FF3.6]</h4>
<p>Type:java.lang.ClassCastException</p>
<p>Message:com.gargoylesoftware.htmlunit.html.HtmlUnknownElement cannot be cast 
to com.gargoylesoftware.htmlunit.html.HtmlInlineFrame</p>
<PRE>
</PRE>
<h4>Test: HTMLIFrameElementTest.writeToIFrame [FF3.6]</h4>
<p>Type:======= EXCEPTION START ======== EcmaError</p>
<p>Message:TypeError: Cannot read property "document" from undefined (script in 
http://localhost:12345/ from (1, 37) to (25, 10)#7)</p>
<PRE>
</PRE>
<h4>Test: HTMLIFrameElementTest.onLoadCalledEachTimeFrameContentChanges 
[IE6]</h4>
<p>Type:======= EXCEPTION START ======== EcmaError</p>
<p>Message:TypeError: Cannot read property "location" from undefined</p>
<PRE>
</PRE>
<h4>Test: HTMLIFrameElementTest.readyState_IFrame [IE6]</h4>
<p>Type:======= EXCEPTION START ======== EcmaError</p>
<p>Message:TypeError: Cannot read property "document" from undefined (script in 
http://localhost:12345/ from (4, 13) to (9, 14)#5)</p>
<PRE>
</PRE>
<h4>Test: HTMLIFrameElementTest.setSrcAttribute [IE6]</h4>
<p>Type:java.lang.ClassCastException</p>
<p>Message:com.gargoylesoftware.htmlunit.html.HtmlUnknownElement cannot be cast 
to com.gargoylesoftware.htmlunit.html.HtmlInlineFrame</p>
<PRE>
</PRE>
<h4>Test: HTMLIFrameElementTest.setSrc_JavascriptUrl [IE6]</h4>
<p>Type:======= EXCEPTION START ======== EcmaError</p>
<p>Message:TypeError: Cannot read property "location" from undefined (script in 
http://localhost:12345/ from (1, 41) to (6, 10)#4)</p>
<PRE>
</PRE>
<h4>Test: HTMLIFrameElementTest.settingInnerHtmlTriggersFrameLoad [IE6]</h4>
<p>Type:java.lang.ClassCastException</p>
<p>Message:com.gargoylesoftware.htmlunit.html.HtmlUnknownElement cannot be cast 
to com.gargoylesoftware.htmlunit.html.HtmlInlineFrame</p>
<PRE>
</PRE>
<h4>Test: HTMLIFrameElementTest.writeToIFrame [IE6]</h4>
<p>Type:======= EXCEPTION START ======== EcmaError</p>
<p>Message:TypeError: Cannot read property "document" from undefined (script in 
http://localhost:12345/ from (1, 37) to (25, 10)#7)</p>
<PRE>
</PRE>
<h4>Test: HTMLIFrameElementTest.onLoadCalledEachTimeFrameContentChanges 
[IE7]</h4>
<p>Type:======= EXCEPTION START ======== EcmaError</p>
<p>Message:TypeError: Cannot read property "location" from undefined</p>
<PRE>
</PRE>
<h4>Test: HTMLIFrameElementTest.readyState_IFrame [IE7]</h4>
<p>Type:======= EXCEPTION START ======== EcmaError</p>
<p>Message:TypeError: Cannot read property "document" from undefined (script in 
http://localhost:12345/ from (4, 13) to (9, 14)#5)</p>
<PRE>
</PRE>
<h4>Test: HTMLIFrameElementTest.setSrcAttribute [IE7]</h4>
<p>Type:java.lang.ClassCastException</p>
<p>Message:com.gargoylesoftware.htmlunit.html.HtmlUnknownElement cannot be cast 
to com.gargoylesoftware.htmlunit.html.HtmlInlineFrame</p>
<PRE>
</PRE>
<h4>Test: HTMLIFrameElementTest.setSrc_JavascriptUrl [IE7]</h4>
<p>Type:======= EXCEPTION START ======== EcmaError</p>
<p>Message:TypeError: Cannot read property "location" from undefined (script in 
http://localhost:12345/ from (1, 41) to (6, 10)#4)</p>
<PRE>
</PRE>
<h4>Test: HTMLIFrameElementTest.settingInnerHtmlTriggersFrameLoad [IE7]</h4>
<p>Type:java.lang.ClassCastException</p>
<p>Message:com.gargoylesoftware.htmlunit.html.HtmlUnknownElement cannot be cast 
to com.gargoylesoftware.htmlunit.html.HtmlInlineFrame</p>
<PRE>
</PRE>
<h4>Test: HTMLIFrameElementTest.writeToIFrame [IE7]</h4>
<p>Type:======= EXCEPTION START ======== EcmaError</p>
<p>Message:TypeError: Cannot read property "document" from undefined (script in 
http://localhost:12345/ from (1, 37) to (25, 10)#7)</p>
<PRE>
</PRE>
<h4>Test: HTMLIFrameElementTest.onLoadCalledEachTimeFrameContentChanges 
[IE8]</h4>
<p>Type:======= EXCEPTION START ======== EcmaError</p>
<p>Message:TypeError: Cannot read property "location" from undefined</p>
<PRE>
</PRE>
<h4>Test: HTMLIFrameElementTest.readyState_IFrame [IE8]</h4>
<p>Type:======= EXCEPTION START ======== EcmaError</p>
<p>Message:TypeError: Cannot read property "document" from undefined (script in 
http://localhost:12345/ from (4, 13) to (9, 14)#5)</p>
<PRE>
</PRE>
<h4>Test: HTMLIFrameElementTest.setSrcAttribute [IE8]</h4>
<p>Type:java.lang.ClassCastException</p>
<p>Message:com.gargoylesoftware.htmlunit.html.HtmlUnknownElement cannot be cast 
to com.gargoylesoftware.htmlunit.html.HtmlInlineFrame</p>
<PRE>
</PRE>
<h4>Test: HTMLIFrameElementTest.setSrc_JavascriptUrl [IE8]</h4>
<p>Type:======= EXCEPTION START ======== EcmaError</p>
<p>Message:TypeError: Cannot read property "location" from undefined (script in 
http://localhost:12345/ from (1, 41) to (6, 10)#4)</p>
<PRE>
</PRE>
<h4>Test: HTMLIFrameElementTest.settingInnerHtmlTriggersFrameLoad [IE8]</h4>
<p>Type:java.lang.ClassCastException</p>
<p>Message:com.gargoylesoftware.htmlunit.html.HtmlUnknownElement cannot be cast 
to com.gargoylesoftware.htmlunit.html.HtmlInlineFrame</p>
<PRE>
</PRE>
<h4>Test: HTMLIFrameElementTest.writeToIFrame [IE8]</h4>
<p>Type:======= EXCEPTION START ======== EcmaError</p>
<p>Message:TypeError: Cannot read property "document" from undefined (script in 
http://localhost:12345/ from (1, 37) to (25, 10)#7)</p>
<PRE>
</PRE>
<h4>Test: HTMLImageElementTest.getSrc_newImage_srcNotSet [FF3.6]</h4>
<p>Type:org.openqa.selenium.WebDriverException</p>
<p>Message:com.gargoylesoftware.htmlunit.ScriptException: TypeError: 
HTMLElement for null is not a function, it is object. (script in 
http://localhost:12345/ from (1, 21) to (6, 10)#3) Build info: version: 
'2.25.0', revision: '17482', time: '2012-07-18 22:18:01' System info: os.name: 
'Linux', os.arch: 'i386', os.version: '2.6.26.3', java.version: '1.6.0_33' 
Driver info: driver.version: HtmlUnitDriver</p>
<PRE>
</PRE>
<h4>Test: HTMLImageElementTest.newImage [FF3.6]</h4>
<p>Type:org.openqa.selenium.WebDriverException</p>
<p>Message:com.gargoylesoftware.htmlunit.ScriptException: TypeError: 
HTMLElement for null is not a function, it is object. (script in 
http://localhost:12345/ from (1, 21) to (10, 10)#3) Build info: version: 
'2.25.0', revision: '17482', time: '2012-07-18 22:18:01' System info: os.name: 
'Linux', os.arch: 'i386', os.version: '2.6.26.3', java.version: '1.6.0_33' 
Driver info: driver.version: HtmlUnitDriver</p>
<PRE>
</PRE>
<h4>Test: HTMLImageElementTest.setSrc_newImage [FF3.6]</h4>
<p>Type:org.openqa.selenium.WebDriverException</p>
<p>Message:com.gargoylesoftware.htmlunit.ScriptException: TypeError: 
HTMLElement for null is not a function, it is object. (script in 
http://localhost:12345/ from (1, 21) to (7, 10)#3) Build info: version: 
'2.25.0', revision: '17482', time: '2012-07-18 22:18:01' System info: os.name: 
'Linux', os.arch: 'i386', os.version: '2.6.26.3', java.version: '1.6.0_33' 
Driver info: driver.version: HtmlUnitDriver</p>
<PRE>
</PRE>
<h4>Test: HTMLImageElementTest.getSrc_newImage_srcNotSet [IE6]</h4>
<p>Type:org.openqa.selenium.WebDriverException</p>
<p>Message:com.gargoylesoftware.htmlunit.ScriptException: ReferenceError: 
"Image" is not defined. (script in http://localhost:12345/ from (1, 21) to (6, 
10)#3) Build info: version: '2.25.0', revision: '17482', time: '2012-07-18 
22:18:01' System info: os.name: 'Linux', os.arch: 'i386', os.version: 
'2.6.26.3', java.version: '1.6.0_33' Driver info: driver.version: 
HtmlUnitDriver</p>
<PRE>
</PRE>
<h4>Test: HTMLImageElementTest.newImage [IE6]</h4>
<p>Type:org.openqa.selenium.WebDriverException</p>
<p>Message:com.gargoylesoftware.htmlunit.ScriptException: ReferenceError: 
"Image" is not defined. (script in http://localhost:12345/ from (1, 21) to (10, 
10)#3) Build info: version: '2.25.0', revision: '17482', time: '2012-07-18 
22:18:01' System info: os.name: 'Linux', os.arch: 'i386', os.version: 
'2.6.26.3', java.version: '1.6.0_33' Driver info: driver.version: 
HtmlUnitDriver</p>
<PRE>
</PRE>
<h4>Test: HTMLImageElementTest.setSrc_newImage [IE6]</h4>
<p>Type:org.openqa.selenium.WebDriverException</p>
<p>Message:com.gargoylesoftware.htmlunit.ScriptException: ReferenceError: 
"Image" is not defined. (script in http://localhost:12345/ from (1, 21) to (7, 
10)#3) Build info: version: '2.25.0', revision: '17482', time: '2012-07-18 
22:18:01' System info: os.name: 'Linux', os.arch: 'i386', os.version: 
'2.6.26.3', java.version: '1.6.0_33' Driver info: driver.version: 
HtmlUnitDriver</p>
<PRE>
</PRE>
<h4>Test: HTMLImageElementTest.getSrc_newImage_srcNotSet [IE7]</h4>
<p>Type:org.openqa.selenium.WebDriverException</p>
<p>Message:com.gargoylesoftware.htmlunit.ScriptException: ReferenceError: 
"Image" is not defined. (script in http://localhost:12345/ from (1, 21) to (6, 
10)#3) Build info: version: '2.25.0', revision: '17482', time: '2012-07-18 
22:18:01' System info: os.name: 'Linux', os.arch: 'i386', os.version: 
'2.6.26.3', java.version: '1.6.0_33' Driver info: driver.version: 
HtmlUnitDriver</p>
<PRE>
</PRE>
<h4>Test: HTMLImageElementTest.newImage [IE7]</h4>
<p>Type:org.openqa.selenium.WebDriverException</p>
<p>Message:com.gargoylesoftware.htmlunit.ScriptException: ReferenceError: 
"Image" is not defined. (script in http://localhost:12345/ from (1, 21) to (10, 
10)#3) Build info: version: '2.25.0', revision: '17482', time: '2012-07-18 
22:18:01' System info: os.name: 'Linux', os.arch: 'i386', os.version: 
'2.6.26.3', java.version: '1.6.0_33' Driver info: driver.version: 
HtmlUnitDriver</p>
<PRE>
</PRE>
<h4>Test: HTMLImageElementTest.setSrc_newImage [IE7]</h4>
<p>Type:org.openqa.selenium.WebDriverException</p>
<p>Message:com.gargoylesoftware.htmlunit.ScriptException: ReferenceError: 
"Image" is not defined. (script in http://localhost:12345/ from (1, 21) to (7, 
10)#3) Build info: version: '2.25.0', revision: '17482', time: '2012-07-18 
22:18:01' System info: os.name: 'Linux', os.arch: 'i386', os.version: 
'2.6.26.3', java.version: '1.6.0_33' Driver info: driver.version: 
HtmlUnitDriver</p>
<PRE>
</PRE>
<h4>Test: HTMLImageElementTest.getSrc_newImage_srcNotSet [IE8]</h4>
<p>Type:org.openqa.selenium.WebDriverException</p>
<p>Message:com.gargoylesoftware.htmlunit.ScriptException: ReferenceError: 
"Image" is not defined. (script in http://localhost:12345/ from (1, 21) to (6, 
10)#3) Build info: version: '2.25.0', revision: '17482', time: '2012-07-18 
22:18:01' System info: os.name: 'Linux', os.arch: 'i386', os.version: 
'2.6.26.3', java.version: '1.6.0_33' Driver info: driver.version: 
HtmlUnitDriver</p>
<PRE>
</PRE>
<h4>Test: HTMLImageElementTest.newImage [IE8]</h4>
<p>Type:org.openqa.selenium.WebDriverException</p>
<p>Message:com.gargoylesoftware.htmlunit.ScriptException: ReferenceError: 
"Image" is not defined. (script in http://localhost:12345/ from (1, 21) to (10, 
10)#3) Build info: version: '2.25.0', revision: '17482', time: '2012-07-18 
22:18:01' System info: os.name: 'Linux', os.arch: 'i386', os.version: 
'2.6.26.3', java.version: '1.6.0_33' Driver info: driver.version: 
HtmlUnitDriver</p>
<PRE>
</PRE>
<h4>Test: HTMLImageElementTest.setSrc_newImage [IE8]</h4>
<p>Type:org.openqa.selenium.WebDriverException</p>
<p>Message:com.gargoylesoftware.htmlunit.ScriptException: ReferenceError: 
"Image" is not defined. (script in http://localhost:12345/ from (1, 21) to (7, 
10)#3) Build info: version: '2.25.0', revision: '17482', time: '2012-07-18 
22:18:01' System info: os.name: 'Linux', os.arch: 'i386', os.version: 
'2.6.26.3', java.version: '1.6.0_33' Driver info: driver.version: 
HtmlUnitDriver</p>
<PRE>
</PRE>
<h4>Test: XMLHttpRequest3Test.testXMLHttpRequestWithDomChangeListenerDeadlock 
[FF3.6]</h4>
<p>Type:======= EXCEPTION START ======== EcmaError</p>
<p>Message:TypeError: Cannot call method "test" of undefined (script in 
http://localhost:12345/ from (2, 9) to (7, 10)#4)</p>
<PRE>
</PRE>
<h4>Test: XMLHttpRequest3Test.testXMLHttpRequestWithDomChangeListenerDeadlock 
[IE6]</h4>
<p>Type:======= EXCEPTION START ======== EcmaError</p>
<p>Message:TypeError: Cannot call method "test" of undefined (script in 
http://localhost:12345/ from (2, 9) to (7, 10)#4)</p>
<PRE>
</PRE>
<h4>Test: XMLHttpRequest3Test.testXMLHttpRequestWithDomChangeListenerDeadlock 
[IE7]</h4>
<p>Type:======= EXCEPTION START ======== EcmaError</p>
<p>Message:TypeError: Cannot call method "test" of undefined (script in 
http://localhost:12345/ from (2, 9) to (7, 10)#4)</p>
<PRE>
</PRE>
<h4>Test: XMLHttpRequest3Test.testXMLHttpRequestWithDomChangeListenerDeadlock 
[IE8]</h4>
<p>Type:======= EXCEPTION START ======== EcmaError</p>
<p>Message:TypeError: Cannot call method "test" of undefined (script in 
http://localhost:12345/ from (2, 9) to (7, 10)#4)</p>
<PRE>
</PRE>
<h4>Test: GWT20Test.dynaTable [FF3.6]</h4>
<p>Type:======= EXCEPTION START ======== EcmaError</p>
<p>Message:TypeError: Cannot read property "location" from undefined 
(http://localhost:12345/dynatable/dynatable.nocache.js#8)</p>
<PRE>
</PRE>
<h4>Test: GWT20Test.hello [FF3.6]</h4>
<p>Type:======= EXCEPTION START ======== EcmaError</p>
<p>Message:TypeError: Cannot read property "location" from undefined 
(file:/raid/volume1/opt/htmlunit/cruisecontrol/checkout/target/test-classes/libraries/GWT/2.0.1/Hello/hello/hello.nocache.js#8)</p>
<PRE>
</PRE>
<h4>Test: GWT20Test.json [FF3.6]</h4>
<p>Type:======= EXCEPTION START ======== EcmaError</p>
<p>Message:TypeError: Cannot read property "location" from undefined 
(file:/raid/volume1/opt/htmlunit/cruisecontrol/checkout/target/test-classes/libraries/GWT/2.0.1/JSON/json/json.nocache.js#8)</p>
<PRE>
</PRE>
<h4>Test: GWT20Test.mail [FF3.6]</h4>
<p>Type:======= EXCEPTION START ======== EcmaError</p>
<p>Message:TypeError: Cannot read property "location" from undefined 
(file:/raid/volume1/opt/htmlunit/cruisecontrol/checkout/target/test-classes/libraries/GWT/2.0.1/Mail/mail/mail.nocache.js#8)</p>
<PRE>
</PRE>
<h4>Test: GWT20Test.showcase [FF3.6]</h4>
<p>Type:======= EXCEPTION START ======== EcmaError</p>
<p>Message:TypeError: Cannot read property "location" from undefined 
(file:/raid/volume1/opt/htmlunit/cruisecontrol/checkout/target/test-classes/libraries/GWT/2.0.1/Showcase/showcase/showcase.nocache.js#10)</p>
<PRE>
</PRE>
<h4>Test: GWT20Test.hello [IE6]</h4>
<p>Type:java.lang.NullPointerException</p>
<p>Message:</p>
<PRE>
</PRE>
<h4>Test: GWT20Test.json [IE6]</h4>
<p>Type:java.lang.NullPointerException</p>
<p>Message:</p>
<PRE>
</PRE>
<h4>Test: GWT20Test.mail [IE6]</h4>
<p>Type:java.lang.NullPointerException</p>
<p>Message:</p>
<PRE>
</PRE>
<h4>Test: GWT20Test.showcase [IE6]</h4>
<p>Type:com.gargoylesoftware.htmlunit.ElementNotFoundException</p>
<p>Message:elementName=[*] attributeName=[id] 
attributeValue=[gwt-debug-cwCheckBox-Monday-label]</p>
<PRE>
</PRE>
<h4>Test: GWT20Test.hello [IE7]</h4>
<p>Type:java.lang.NullPointerException</p>
<p>Message:</p>
<PRE>
</PRE>
<h4>Test: GWT20Test.json [IE7]</h4>
<p>Type:java.lang.NullPointerException</p>
<p>Message:</p>
<PRE>
</PRE>
<h4>Test: GWT20Test.mail [IE7]</h4>
<p>Type:java.lang.NullPointerException</p>
<p>Message:</p>
<PRE>
</PRE>
<h4>Test: GWT20Test.showcase [IE7]</h4>
<p>Type:com.gargoylesoftware.htmlunit.ElementNotFoundException</p>
<p>Message:elementName=[*] attributeName=[id] 
attributeValue=[gwt-debug-cwCheckBox-Monday-label]</p>
<PRE>
</PRE>
<h4>Test: GWT20Test.hello [IE8]</h4>
<p>Type:java.lang.NullPointerException</p>
<p>Message:</p>
<PRE>
</PRE>
<h4>Test: GWT20Test.json [IE8]</h4>
<p>Type:java.lang.NullPointerException</p>
<p>Message:</p>
<PRE>
</PRE>
<h4>Test: GWT20Test.mail [IE8]</h4>
<p>Type:java.lang.NullPointerException</p>
<p>Message:</p>
<PRE>
</PRE>
<h4>Test: GWT20Test.showcase [IE8]</h4>
<p>Type:com.gargoylesoftware.htmlunit.ElementNotFoundException</p>
<p>Message:elementName=[*] attributeName=[id] 
attributeValue=[gwt-debug-cwCheckBox-Monday-label]</p>
<PRE>
</PRE>
<h4>Test: WebClientTest.testCurrentWindow [FF3.6]</h4>
<p>Type:org.junit.ComparisonFailure</p>
<p>Message:expected:<...p://localhost:12345/[frame.html]> but 
was:<...p://localhost:12345/[]></p>
<PRE>
</PRE>
<h4>Test: WebClientTest.testCurrentWindow [IE6]</h4>
<p>Type:org.junit.ComparisonFailure</p>
<p>Message:expected:<...p://localhost:12345/[frame.html]> but 
was:<...p://localhost:12345/[]></p>
<PRE>
</PRE>
<h4>Test: WebClientTest.testCurrentWindow [IE7]</h4>
<p>Type:org.junit.ComparisonFailure</p>
<p>Message:expected:<...p://localhost:12345/[frame.html]> but 
was:<...p://localhost:12345/[]></p>
<PRE>
</PRE>
<h4>Test: WebClientTest.testCurrentWindow [IE8]</h4>
<p>Type:org.junit.ComparisonFailure</p>
<p>Message:expected:<...p://localhost:12345/[frame.html]> but 
was:<...p://localhost:12345/[]></p>
<PRE>
</PRE>
<h4>Test: HtmlInlineFrame2Test.selfClosingIFrame [FF3.6]</h4>
<p>Type:org.junit.ComparisonFailure</p>
<p>Message:expected:<[[1, [object HTMLIFrame]Element], null]> but 
was:<[[0, [object HTMLUnknown]Element], null]></p>
<PRE>
</PRE>
<h4>Test: HtmlInlineFrame2Test.simpleScriptable [FF3.6]</h4>
<p>Type:org.junit.ComparisonFailure</p>
<p>Message:expected:<[[object HTML[IFrame]Element]]> but was:<[[object 
HTML[Unknown]Element]]></p>
<PRE>
</PRE>
<h4>Test: HtmlInlineFrame2Test.selfClosingIFrame [IE6]</h4>
<p>Type:org.junit.ComparisonFailure</p>
<p>Message:expected:<[[2], [object], [object]...> but was:<[[0], 
[object], [object]...></p>
<PRE>
</PRE>
<h4>Test: HtmlInlineFrame2Test.simpleScriptable [IE6]</h4>
<p>Type:java.lang.AssertionError</p>
<p>Message:</p>
<PRE>
</PRE>
<h4>Test: HtmlInlineFrame2Test.selfClosingIFrame [IE7]</h4>
<p>Type:org.junit.ComparisonFailure</p>
<p>Message:expected:<[[2], [object], [object]...> but was:<[[0], 
[object], [object]...></p>
<PRE>
</PRE>
<h4>Test: HtmlInlineFrame2Test.simpleScriptable [IE7]</h4>
<p>Type:java.lang.AssertionError</p>
<p>Message:</p>
<PRE>
</PRE>
<h4>Test: HtmlInlineFrame2Test.selfClosingIFrame [IE8]</h4>
<p>Type:org.junit.ComparisonFailure</p>
<p>Message:expected:<[[2], [object], [object]...> but was:<[[0], 
[object], [object]...></p>
<PRE>
</PRE>
<h4>Test: HtmlInlineFrame2Test.simpleScriptable [IE8]</h4>
<p>Type:java.lang.AssertionError</p>
<p>Message:</p>
<PRE>
</PRE>
<h4>Test: HtmlInlineFrameTest.testScriptUnderIFrame [IE6]</h4>
<p>Type:org.junit.ComparisonFailure</p>
<p>Message:expected:<[[]2]> but was:<[[1, 3, ]2]></p>
<PRE>
</PRE>
<h4>Test: HtmlInlineFrameTest.testScriptUnderIFrame [IE7]</h4>
<p>Type:org.junit.ComparisonFailure</p>
<p>Message:expected:<[[]2]> but was:<[[1, 3, ]2]></p>
<PRE>
</PRE>
<h4>Test: HtmlInlineFrameTest.testScriptUnderIFrame [IE8]</h4>
<p>Type:org.junit.ComparisonFailure</p>
<p>Message:expected:<[[]2]> but was:<[[1, 3, ]2]></p>
<PRE>
</PRE>
<h4>Test: HtmlIsIndex2Test.simpleScriptable [FF3.6]</h4>
<p>Type:org.junit.ComparisonFailure</p>
<p>Message:expected:<[[object HTML[IsIndex]Element]]> but 
was:<[[object HTML[Unknown]Element]]></p>
<PRE>
</PRE>
<h4>Test: HtmlIsIndex2Test.simpleScriptable [IE6]</h4>
<p>Type:java.lang.AssertionError</p>
<p>Message:</p>
<PRE>
</PRE>
<h4>Test: HtmlIsIndex2Test.simpleScriptable [IE7]</h4>
<p>Type:java.lang.AssertionError</p>
<p>Message:</p>
<PRE>
</PRE>
<h4>Test: HtmlIsIndex2Test.simpleScriptable [IE8]</h4>
<p>Type:java.lang.AssertionError</p>
<p>Message:</p>
<PRE>
</PRE>
<h4>Test: HtmlPage2Test.loadExternalJavaScript [FF3.6]</h4>
<p>Type:org.junit.ComparisonFailure</p>
<p>Message:expected:<[[25]]> but was:<[[]]></p>
<PRE>
</PRE>
<h4>Test: HtmlPage2Test.loadExternalJavaScript_absolute [FF3.6]</h4>
<p>Type:org.junit.ComparisonFailure</p>
<p>Message:expected:<[[25]]> but was:<[[]]></p>
<PRE>
</PRE>
<h4>Test: HtmlPage2Test.save_frames [FF3.6]</h4>
<p>Type:java.lang.AssertionError</p>
<p>Message:/tmp/junit9138195233727158270/hu/hu_HtmlPageTest_saveFrame/second/iframe.html</p>
<PRE>
</PRE>
<h4>Test: HtmlPage2Test.serialization_attributeListenerLock [FF3.6]</h4>
<p>Type:org.junit.ComparisonFailure</p>
<p>Message:expected:<[http://localhost:12345/]> but 
was:<[about:blank]></p>
<PRE>
</PRE>
<h4>Test: HtmlPage2Test.loadExternalJavaScript [IE6]</h4>
<p>Type:org.junit.ComparisonFailure</p>
<p>Message:expected:<[[25]]> but was:<[[]]></p>
<PRE>
</PRE>
<h4>Test: HtmlPage2Test.loadExternalJavaScript_absolute [IE6]</h4>
<p>Type:org.junit.ComparisonFailure</p>
<p>Message:expected:<[[25]]> but was:<[[]]></p>
<PRE>
</PRE>
<h4>Test: HtmlPage2Test.save_frames [IE6]</h4>
<p>Type:java.lang.AssertionError</p>
<p>Message:/tmp/junit2996405273815030316/hu/hu_HtmlPageTest_saveFrame/second/iframe.html</p>
<PRE>
</PRE>
<h4>Test: HtmlPage2Test.serialization_attributeListenerLock [IE6]</h4>
<p>Type:org.junit.ComparisonFailure</p>
<p>Message:expected:<[http://localhost:12345/]> but 
was:<[about:blank]></p>
<PRE>
</PRE>
<h4>Test: HtmlPage2Test.loadExternalJavaScript [IE7]</h4>
<p>Type:org.junit.ComparisonFailure</p>
<p>Message:expected:<[[error]]> but was:<[[]]></p>
<PRE>
</PRE>
<h4>Test: HtmlPage2Test.loadExternalJavaScript_absolute [IE7]</h4>
<p>Type:org.junit.ComparisonFailure</p>
<p>Message:expected:<[[25]]> but was:<[[]]></p>
<PRE>
</PRE>
<h4>Test: HtmlPage2Test.save_frames [IE7]</h4>
<p>Type:java.lang.AssertionError</p>
<p>Message:/tmp/junit3610771245960653662/hu/hu_HtmlPageTest_saveFrame/second/iframe.html</p>
<PRE>
</PRE>
<h4>Test: HtmlPage2Test.serialization_attributeListenerLock [IE7]</h4>
<p>Type:org.junit.ComparisonFailure</p>
<p>Message:expected:<[http://localhost:12345/]> but 
was:<[about:blank]></p>
<PRE>
</PRE>
<h4>Test: HtmlPage2Test.loadExternalJavaScript [IE8]</h4>
<p>Type:org.junit.ComparisonFailure</p>
<p>Message:expected:<[[25]]> but was:<[[]]></p>
<PRE>
</PRE>
<h4>Test: HtmlPage2Test.loadExternalJavaScript_absolute [IE8]</h4>
<p>Type:org.junit.ComparisonFailure</p>
<p>Message:expected:<[[25]]> but was:<[[]]></p>
<PRE>
</PRE>
<h4>Test: HtmlPage2Test.save_frames [IE8]</h4>
<p>Type:java.lang.AssertionError</p>
<p>Message:/tmp/junit2215723980160274707/hu/hu_HtmlPageTest_saveFrame/second/iframe.html</p>
<PRE>
</PRE>
<h4>Test: HtmlPage2Test.serialization_attributeListenerLock [IE8]</h4>
<p>Type:org.junit.ComparisonFailure</p>
<p>Message:expected:<[http://localhost:12345/]> but 
was:<[about:blank]></p>
<PRE>
</PRE>
<h4>Test: HtmlPageTest.asXmlValidHtmlOutput [FF3.6]</h4>
<p>Type:org.junit.ComparisonFailure</p>
<p>Message:expected:<...me 
src='about:blank'[></iframe]></body></html>> but 
was:<...me src='about:blank'[/]></body></html>></p>
<PRE>
</PRE>
<h4>Test: HtmlPageTest.asXmlValidHtmlOutput [IE6]</h4>
<p>Type:org.junit.ComparisonFailure</p>
<p>Message:expected:<...me 
src='about:blank'[></iframe]></body></html>> but 
was:<...me src='about:blank'[/]></body></html>></p>
<PRE>
</PRE>
<h4>Test: HtmlPageTest.asXmlValidHtmlOutput [IE7]</h4>
<p>Type:org.junit.ComparisonFailure</p>
<p>Message:expected:<...me 
src='about:blank'[></iframe]></body></html>> but 
was:<...me src='about:blank'[/]></body></html>></p>
<PRE>
</PRE>
<h4>Test: HtmlPageTest.asXmlValidHtmlOutput [IE8]</h4>
<p>Type:org.junit.ComparisonFailure</p>
<p>Message:expected:<...me 
src='about:blank'[></iframe]></body></html>> but 
was:<...me src='about:blank'[/]></body></html>></p>
<PRE>
</PRE>
<h4>Test: PostponedActionTest.loadingJavaScript [FF3.6]</h4>
<p>Type:org.junit.ComparisonFailure</p>
<p>Message:expected:<[before, after[, second.html, third.html]]> but 
was:<[before, after[]]></p>
<PRE>
</PRE>
<h4>Test: PostponedActionTest.loadingJavaScript [IE6]</h4>
<p>Type:org.junit.ComparisonFailure</p>
<p>Message:expected:<[before, after[, second.html, third.html]]> but 
was:<[before, after[]]></p>
<PRE>
</PRE>
<h4>Test: PostponedActionTest.loadingJavaScript [IE7]</h4>
<p>Type:org.junit.ComparisonFailure</p>
<p>Message:expected:<[before, after[, second.html, third.html]]> but 
was:<[before, after[]]></p>
<PRE>
</PRE>
<h4>Test: PostponedActionTest.loadingJavaScript [IE8]</h4>
<p>Type:org.junit.ComparisonFailure</p>
<p>Message:expected:<[before, after[, second.html, third.html]]> but 
was:<[before, after[]]></p>
<PRE>
</PRE>
<h4>Test: 
SimpleScriptableTest.htmlJavaScriptMapping_AllJavaScriptClassesArePresent 
[FF3.6]</h4>
<p>Type:org.junit.ComparisonFailure</p>
<p>Message:expected:<...MLHtmlElement, HTMLI[FrameElement, 
HTMLI]mageElement, HTMLInp...> but was:<...MLHtmlElement, 
HTMLI[]mageElement, HTMLInp...></p>
<PRE>
</PRE>
<h4>Test: 
SimpleScriptableTest.htmlJavaScriptMapping_AllJavaScriptClassesArePresent 
[IE6]</h4>
<p>Type:org.junit.ComparisonFailure</p>
<p>Message:expected:<...MLHtmlElement, HTMLI[FrameElement, 
HTMLI]mageElement, HTMLInp...> but was:<...MLHtmlElement, 
HTMLI[]mageElement, HTMLInp...></p>
<PRE>
</PRE>
<h4>Test: 
SimpleScriptableTest.htmlJavaScriptMapping_AllJavaScriptClassesArePresent 
[IE7]</h4>
<p>Type:org.junit.ComparisonFailure</p>
<p>Message:expected:<...MLHtmlElement, HTMLI[FrameElement, 
HTMLI]mageElement, HTMLInp...> but was:<...MLHtmlElement, 
HTMLI[]mageElement, HTMLInp...></p>
<PRE>
</PRE>
<h4>Test: 
SimpleScriptableTest.htmlJavaScriptMapping_AllJavaScriptClassesArePresent 
[IE8]</h4>
<p>Type:org.junit.ComparisonFailure</p>
<p>Message:expected:<...MLHtmlElement, HTMLI[FrameElement, 
HTMLI]mageElement, HTMLInp...> but was:<...MLHtmlElement, 
HTMLI[]mageElement, HTMLInp...></p>
<PRE>
</PRE>
<h4>Test: EventTest.testEventScope [FF3.6]</h4>
<p>Type:org.junit.ComparisonFailure</p>
<p>Message:expected:<[[frame1]]> but was:<[[]]></p>
<PRE>
</PRE>
<h4>Test: EventTest.testEventScope [IE6]</h4>
<p>Type:org.junit.ComparisonFailure</p>
<p>Message:expected:<[[frame1]]> but was:<[[]]></p>
<PRE>
</PRE>
<h4>Test: EventTest.testEventScope [IE7]</h4>
<p>Type:org.junit.ComparisonFailure</p>
<p>Message:expected:<[[frame1]]> but was:<[[]]></p>
<PRE>
</PRE>
<h4>Test: EventTest.testEventScope [IE8]</h4>
<p>Type:org.junit.ComparisonFailure</p>
<p>Message:expected:<[[frame1]]> but was:<[[]]></p>
<PRE>
</PRE>
<h4>Test: test[283]</h4>
<p>Type:org.junit.ComparisonFailure</p>
<p>Message:Test for [FF3.6:iframe] expected:<[object 
HTML[IFrame]Element]> but was:<[object HTML[Unknown]Element]></p>
<PRE>
</PRE>
<h4>Test: test[311]</h4>
<p>Type:org.junit.ComparisonFailure</p>
<p>Message:Test for [FF3.6:isIndex] expected:<[object 
HTML[IsIndex]Element]> but was:<[object HTML[Unknown]Element]></p>
<PRE>
</PRE>
<h4>Test: Window2Test.framesAreWindows [FF3.6]</h4>
<p>Type:org.junit.ComparisonFailure</p>
<p>Message:expected:<...], [object Window], [1, true, true, [object 
Window]], true, true, no fun...> but was:<...], [object Window], [0, 
true, true, undefined], true, true, no fun...></p>
<PRE>
</PRE>
<h4>Test: Window2Test.framesAreWindows [IE6]</h4>
<p>Type:org.junit.ComparisonFailure</p>
<p>Message:expected:<...[object], [object], [1, true, true, [object], true, 
true, [object]], true, true, undefi...> but was:<...[object], [object], 
[0, true, true, undefined, true, true, undefined], true, true, undefi...></p>
<PRE>
</PRE>
<h4>Test: Window2Test.framesAreWindows [IE7]</h4>
<p>Type:org.junit.ComparisonFailure</p>
<p>Message:expected:<...[object], [object], [1, true, true, [object], true, 
true, [object]], true, true, undefi...> but was:<...[object], [object], 
[0, true, true, undefined, true, true, undefined], true, true, undefi...></p>
<PRE>
</PRE>
<h4>Test: Window2Test.framesAreWindows [IE8]</h4>
<p>Type:org.junit.ComparisonFailure</p>
<p>Message:expected:<...[object], [object], [1, true, true, [object], true, 
true, [object]], true, true, undefi...> but was:<...[object], [object], 
[0, true, true, undefined, true, true, undefined], true, true, undefi...></p>
<PRE>
</PRE>
<h4>Test: WindowTest.parentAndTop [FF3.6]</h4>
<p>Type:org.junit.ComparisonFailure</p>
<p>Message:expected:<..., true, true, true, [true, tru]e]> but 
was:<..., true, true, true, [false, fals]e]></p>
<PRE>
</PRE>
<h4>Test: WindowTest.parentAndTop [IE6]</h4>
<p>Type:org.junit.ComparisonFailure</p>
<p>Message:expected:<..., true, true, true, [true, tru]e]> but 
was:<..., true, true, true, [false, fals]e]></p>
<PRE>
</PRE>
<h4>Test: WindowTest.parentAndTop [IE7]</h4>
<p>Type:org.junit.ComparisonFailure</p>
<p>Message:expected:<..., true, true, true, [true, tru]e]> but 
was:<..., true, true, true, [false, fals]e]></p>
<PRE>
</PRE>
<h4>Test: WindowTest.parentAndTop [IE8]</h4>
<p>Type:org.junit.ComparisonFailure</p>
<p>Message:expected:<..., true, true, true, [true, tru]e]> but 
was:<..., true, true, true, [false, fals]e]></p>
<PRE>
</PRE>
<h4>Test: HTMLDocumentTest.frameAccessByName [FF3.6]</h4>
<p>Type:org.junit.ComparisonFailure</p>
<p>Message:expected:<[undefined, [fals]e]> but was:<[undefined, 
[tru]e]></p>
<PRE>
</PRE>
<h4>Test: HTMLDocumentTest.frameAccessByName [IE6]</h4>
<p>Type:org.junit.ComparisonFailure</p>
<p>Message:expected:<[[[object]], true]> but was:<[[undefined], 
true]></p>
<PRE>
</PRE>
<h4>Test: HTMLDocumentTest.frameAccessByName [IE7]</h4>
<p>Type:org.junit.ComparisonFailure</p>
<p>Message:expected:<[[[object]], true]> but was:<[[undefined], 
true]></p>
<PRE>
</PRE>
<h4>Test: HTMLDocumentTest.frameAccessByName [IE8]</h4>
<p>Type:org.junit.ComparisonFailure</p>
<p>Message:expected:<[[[object]], true]> but was:<[[undefined], 
true]></p>
<PRE>
</PRE>
<h4>Test: HTMLFormElement2Test.submitWithTargetOnIFrameAndOnload_bubbling_FF 
[FF3.6]</h4>
<p>Type:org.junit.ComparisonFailure</p>
<p>Message:expected:<[submit form[, submitted ok]]> but was:<[submit 
form[]]></p>
<PRE>
</PRE>
<h4>Test: HTMLFormElement2Test.submitWithTargetOnIFrameAndOnload_script 
[FF3.6]</h4>
<p>Type:org.junit.ComparisonFailure</p>
<p>Message:expected:<...e frame, submit form[, submitted ok]]> but 
was:<...e frame, submit form[]]></p>
<PRE>
</PRE>
<h4>Test: HTMLFormElement2Test.submitWithTargetOnIFrameAndOnload_attached_IE 
[IE6]</h4>
<p>Type:org.junit.ComparisonFailure</p>
<p>Message:expected:<[submit form[, submitted ok]]> but was:<[submit 
form[]]></p>
<PRE>
</PRE>
<h4>Test: HTMLFormElement2Test.submitWithTargetOnIFrameAndOnload_script 
[IE6]</h4>
<p>Type:org.junit.ComparisonFailure</p>
<p>Message:expected:<...e frame, submit form[, submitted ok]]> but 
was:<...e frame, submit form[]]></p>
<PRE>
</PRE>
<h4>Test: HTMLFormElement2Test.submitWithTargetOnIFrameAndOnload_attached_IE 
[IE7]</h4>
<p>Type:org.junit.ComparisonFailure</p>
<p>Message:expected:<[submit form[, submitted ok]]> but was:<[submit 
form[]]></p>
<PRE>
</PRE>
<h4>Test: HTMLFormElement2Test.submitWithTargetOnIFrameAndOnload_script 
[IE7]</h4>
<p>Type:org.junit.ComparisonFailure</p>
<p>Message:expected:<...e frame, submit form[, submitted ok]]> but 
was:<...e frame, submit form[]]></p>
<PRE>
</PRE>
<h4>Test: HTMLFormElement2Test.submitWithTargetOnIFrameAndOnload_attached_IE 
[IE8]</h4>
<p>Type:org.junit.ComparisonFailure</p>
<p>Message:expected:<[submit form[, submitted ok]]> but was:<[submit 
form[]]></p>
<PRE>
</PRE>
<h4>Test: HTMLFormElement2Test.submitWithTargetOnIFrameAndOnload_script 
[IE8]</h4>
<p>Type:org.junit.ComparisonFailure</p>
<p>Message:expected:<...e frame, submit form[, submitted ok]]> but 
was:<...e frame, submit form[]]></p>
<PRE>
</PRE>
<h4>Test: HTMLIFrameElement2Test.documentCreateElement_onLoad [FF3.6]</h4>
<p>Type:org.junit.ComparisonFailure</p>
<p>Message:expected:<[[loaded, foo]]> but was:<[[]]></p>
<PRE>
</PRE>
<h4>Test: HTMLIFrameElement2Test.documentCreateElement_onLoad2 [FF3.6]</h4>
<p>Type:org.junit.ComparisonFailure</p>
<p>Message:expected:<[createIFrame[, loaded, foo]]> but 
was:<[createIFrame[]]></p>
<PRE>
</PRE>
<h4>Test: HTMLIFrameElement2Test.documentCreateElement_onLoad2_noSrc 
[FF3.6]</h4>
<p>Type:org.junit.ComparisonFailure</p>
<p>Message:expected:<[createIFrame[, loaded, ]]> but 
was:<[createIFrame[]]></p>
<PRE>
</PRE>
<h4>Test: HTMLIFrameElement2Test.documentCreateElement_onLoad3 [FF3.6]</h4>
<p>Type:org.junit.ComparisonFailure</p>
<p>Message:expected:<[createIFrame[, loaded, foo]]> but 
was:<[createIFrame[]]></p>
<PRE>
</PRE>
<h4>Test: HTMLIFrameElement2Test.documentCreateElement_onLoad3_noSrc 
[FF3.6]</h4>
<p>Type:org.junit.ComparisonFailure</p>
<p>Message:expected:<[createIFrame[, loaded, ]]> but 
was:<[createIFrame[]]></p>
<PRE>
</PRE>
<h4>Test: HTMLIFrameElement2Test.documentCreateElement_onLoad_noSrc [FF3.6]</h4>
<p>Type:org.junit.ComparisonFailure</p>
<p>Message:expected:<[[loaded, ]]> but was:<[[]]></p>
<PRE>
</PRE>
<h4>Test: HTMLIFrameElement2Test.documentDocumentFragmentCreateElement_onLoad 
[FF3.6]</h4>
<p>Type:org.junit.ComparisonFailure</p>
<p>Message:expected:<...fragment append done[, loaded]]> but 
was:<...fragment append done[]]></p>
<PRE>
</PRE>
<h4>Test: HTMLIFrameElement2Test.documentDocumentFragmentCreateElement_onLoad2 
[FF3.6]</h4>
<p>Type:org.junit.ComparisonFailure</p>
<p>Message:expected:<...fragment append done[, loaded]]> but 
was:<...fragment append done[]]></p>
<PRE>
</PRE>
<h4>Test: 
HTMLIFrameElement2Test.documentDocumentFragmentCreateElement_onLoad2_noSrc 
[FF3.6]</h4>
<p>Type:org.junit.ComparisonFailure</p>
<p>Message:expected:<...fragment append done[, loaded]]> but 
was:<...fragment append done[]]></p>
<PRE>
</PRE>
<h4>Test: HTMLIFrameElement2Test.documentDocumentFragmentCreateElement_onLoad3 
[FF3.6]</h4>
<p>Type:org.junit.ComparisonFailure</p>
<p>Message:expected:<...fragment append done[, loaded]]> but 
was:<...fragment append done[]]></p>
<PRE>
</PRE>
<h4>Test: 
HTMLIFrameElement2Test.documentDocumentFragmentCreateElement_onLoad3_noSrc 
[FF3.6]</h4>
<p>Type:org.junit.ComparisonFailure</p>
<p>Message:expected:<...fragment append done[, loaded]]> but 
was:<...fragment append done[]]></p>
<PRE>
</PRE>
<h4>Test: 
HTMLIFrameElement2Test.documentDocumentFragmentCreateElement_onLoad_noSrc 
[FF3.6]</h4>
<p>Type:org.junit.ComparisonFailure</p>
<p>Message:expected:<...fragment append done[, loaded]]> but 
was:<...fragment append done[]]></p>
<PRE>
</PRE>
<h4>Test: HTMLIFrameElement2Test.getAlign [FF3.6]</h4>
<p>Type:org.junit.ComparisonFailure</p>
<p>Message:expected:<...middle, top, wrong, []]> but was:<...middle, 
top, wrong, [undefined]]></p>
<PRE>
</PRE>
<h4>Test: HTMLIFrameElement2Test.setAlign [FF3.6]</h4>
<p>Type:org.junit.ComparisonFailure</p>
<p>Message:expected:<[[cent]er, 8, foo, left, ri...> but 
was:<[[CenT]er, 8, foo, left, ri...></p>
<PRE>
</PRE>
<h4>Test: 
HTMLIFrameElement2Test.documentDocumentFragmentCreateElement_onLoad2_noSrc 
[IE6]</h4>
<p>Type:org.junit.ComparisonFailure</p>
<p>Message:expected:<...fragment append done[, loaded]]> but 
was:<...fragment append done[]]></p>
<PRE>
</PRE>
<h4>Test: 
HTMLIFrameElement2Test.documentDocumentFragmentCreateElement_onLoad3_noSrc 
[IE6]</h4>
<p>Type:org.junit.ComparisonFailure</p>
<p>Message:expected:<...fragment append done[, loaded]]> but 
was:<...fragment append done[]]></p>
<PRE>
</PRE>
<h4>Test: 
HTMLIFrameElement2Test.documentDocumentFragmentCreateElement_onLoad_noSrc 
[IE6]</h4>
<p>Type:org.junit.ComparisonFailure</p>
<p>Message:expected:<...fragment append done[, loaded]]> but 
was:<...fragment append done[]]></p>
<PRE>
</PRE>
<h4>Test: 
HTMLIFrameElement2Test.documentDocumentFragmentCreateElement_onLoad2_noSrc 
[IE7]</h4>
<p>Type:org.junit.ComparisonFailure</p>
<p>Message:expected:<...fragment append done[, loaded]]> but 
was:<...fragment append done[]]></p>
<PRE>
</PRE>
<h4>Test: 
HTMLIFrameElement2Test.documentDocumentFragmentCreateElement_onLoad3_noSrc 
[IE7]</h4>
<p>Type:org.junit.ComparisonFailure</p>
<p>Message:expected:<...fragment append done[, loaded]]> but 
was:<...fragment append done[]]></p>
<PRE>
</PRE>
<h4>Test: 
HTMLIFrameElement2Test.documentDocumentFragmentCreateElement_onLoad_noSrc 
[IE7]</h4>
<p>Type:org.junit.ComparisonFailure</p>
<p>Message:expected:<...fragment append done[, loaded]]> but 
was:<...fragment append done[]]></p>
<PRE>
</PRE>
<h4>Test: 
HTMLIFrameElement2Test.documentDocumentFragmentCreateElement_onLoad2_noSrc 
[IE8]</h4>
<p>Type:org.junit.ComparisonFailure</p>
<p>Message:expected:<...fragment append done[, loaded]]> but 
was:<...fragment append done[]]></p>
<PRE>
</PRE>
<h4>Test: 
HTMLIFrameElement2Test.documentDocumentFragmentCreateElement_onLoad3_noSrc 
[IE8]</h4>
<p>Type:org.junit.ComparisonFailure</p>
<p>Message:expected:<...fragment append done[, loaded]]> but 
was:<...fragment append done[]]></p>
<PRE>
</PRE>
<h4>Test: 
HTMLIFrameElement2Test.documentDocumentFragmentCreateElement_onLoad_noSrc 
[IE8]</h4>
<p>Type:org.junit.ComparisonFailure</p>
<p>Message:expected:<...fragment append done[, loaded]]> but 
was:<...fragment append done[]]></p>
<PRE>
</PRE>
<h4>Test: HTMLIFrameElementTest.contentDocument [FF3.6]</h4>
<p>Type:org.junit.ComparisonFailure</p>
<p>Message:expected:<[[tru]e]> but was:<[[fals]e]></p>
<PRE>
</PRE>
<h4>Test: HTMLIFrameElementTest.frameElement [FF3.6]</h4>
<p>Type:org.junit.ComparisonFailure</p>
<p>Message:expected:<[[tru]e]> but was:<[[fals]e]></p>
<PRE>
</PRE>
<h4>Test: HTMLIFrameElementTest.height [FF3.6]</h4>
<p>Type:org.junit.ComparisonFailure</p>
<p>Message:expected:<[[, 100, foo, 20%, 0, 30, 400, abc, 0, 100], 10%, 
300]> but was:<[[undefined, 100, foo, 20%, -5, 30.2, 400, abc, -5, 
100.2], 10%, 300]></p>
<PRE>
</PRE>
<h4>Test: HTMLIFrameElementTest.idByName [FF3.6]</h4>
<p>Type:org.junit.ComparisonFailure</p>
<p>Message:expected:<[[object HTML[IFrameElement], [object 
HTMLIFrameElement], , ]]> but was:<[[object HTML[UnknownElement], [object 
HTMLUnknownElement], undefined, undefined]]></p>
<PRE>
</PRE>
<h4>Test: HTMLIFrameElementTest.referenceFromJavaScript [FF3.6]</h4>
<p>Type:org.junit.ComparisonFailure</p>
<p>Message:expected:<[[1], myIFrame]> but was:<[[0], myIFrame]></p>
<PRE>
</PRE>
<h4>Test: HTMLIFrameElementTest.width [FF3.6]</h4>
<p>Type:org.junit.ComparisonFailure</p>
<p>Message:expected:<[[, 100, foo, 20%, 0, 30, 400, abc, 0, 100], 10%, 
300]> but was:<[[undefined, 100, foo, 20%, -5, 30.2, 400, abc, -5, 
100.2], 10%, 300]></p>
<PRE>
</PRE>
<h4>Test: HTMLIFrameElementTest.width_px [FF3.6]</h4>
<p>Type:org.junit.ComparisonFailure</p>
<p>Message:expected:<[128[]]> but was:<[128[px]]></p>
<PRE>
</PRE>
<h4>Test: HTMLIFrameElementTest.frameElement [IE6]</h4>
<p>Type:org.junit.ComparisonFailure</p>
<p>Message:expected:<[[tru]e]> but was:<[[fals]e]></p>
<PRE>
</PRE>
<h4>Test: HTMLIFrameElementTest.height [IE6]</h4>
<p>Type:org.junit.ComparisonFailure</p>
<p>Message:expected:<[[, 100, , 20%, -5, 30, error, 400, 100, -5, 100], 10%, 
300]> but was:<[[undefined, 100, foo, 20%, -5, 30.2, 400, abc, -5, 
100.2], 10%, 300]></p>
<PRE>
</PRE>
<h4>Test: HTMLIFrameElementTest.referenceFromJavaScript [IE6]</h4>
<p>Type:org.junit.ComparisonFailure</p>
<p>Message:expected:<[[1], myIFrame]> but was:<[[0], myIFrame]></p>
<PRE>
</PRE>
<h4>Test: HTMLIFrameElementTest.width [IE6]</h4>
<p>Type:org.junit.ComparisonFailure</p>
<p>Message:expected:<[[, 100, , 20%, -5, 30, error, 400, 100, -5, 100], 10%, 
300]> but was:<[[undefined, 100, foo, 20%, -5, 30.2, 400, abc, -5, 
100.2], 10%, 300]></p>
<PRE>
</PRE>
<h4>Test: HTMLIFrameElementTest.width_px [IE6]</h4>
<p>Type:org.junit.ComparisonFailure</p>
<p>Message:expected:<[128[]]> but was:<[128[px]]></p>
<PRE>
</PRE>
<h4>Test: HTMLIFrameElementTest.frameElement [IE7]</h4>
<p>Type:org.junit.ComparisonFailure</p>
<p>Message:expected:<[[tru]e]> but was:<[[fals]e]></p>
<PRE>
</PRE>
<h4>Test: HTMLIFrameElementTest.height [IE7]</h4>
<p>Type:org.junit.ComparisonFailure</p>
<p>Message:expected:<[[, 100, , 20%, -5, 30, error, 400, 100, -5, 100], 10%, 
300]> but was:<[[undefined, 100, foo, 20%, -5, 30.2, 400, abc, -5, 
100.2], 10%, 300]></p>
<PRE>
</PRE>
<h4>Test: HTMLIFrameElementTest.referenceFromJavaScript [IE7]</h4>
<p>Type:org.junit.ComparisonFailure</p>
<p>Message:expected:<[[1], myIFrame]> but was:<[[0], myIFrame]></p>
<PRE>
</PRE>
<h4>Test: HTMLIFrameElementTest.width [IE7]</h4>
<p>Type:org.junit.ComparisonFailure</p>
<p>Message:expected:<[[, 100, , 20%, -5, 30, error, 400, 100, -5, 100], 10%, 
300]> but was:<[[undefined, 100, foo, 20%, -5, 30.2, 400, abc, -5, 
100.2], 10%, 300]></p>
<PRE>
</PRE>
<h4>Test: HTMLIFrameElementTest.width_px [IE7]</h4>
<p>Type:org.junit.ComparisonFailure</p>
<p>Message:expected:<[128[]]> but was:<[128[px]]></p>
<PRE>
</PRE>
<h4>Test: HTMLIFrameElementTest.frameElement [IE8]</h4>
<p>Type:org.junit.ComparisonFailure</p>
<p>Message:expected:<[[tru]e]> but was:<[[fals]e]></p>
<PRE>
</PRE>
<h4>Test: HTMLIFrameElementTest.height [IE8]</h4>
<p>Type:org.junit.ComparisonFailure</p>
<p>Message:expected:<[[, 100, , 20%, -5, 30, error, 400, 100, -5, 100], 10%, 
300]> but was:<[[undefined, 100, foo, 20%, -5, 30.2, 400, abc, -5, 
100.2], 10%, 300]></p>
<PRE>
</PRE>
<h4>Test: HTMLIFrameElementTest.referenceFromJavaScript [IE8]</h4>
<p>Type:org.junit.ComparisonFailure</p>
<p>Message:expected:<[[1], myIFrame]> but was:<[[0], myIFrame]></p>
<PRE>
</PRE>
<h4>Test: HTMLIFrameElementTest.width [IE8]</h4>
<p>Type:org.junit.ComparisonFailure</p>
<p>Message:expected:<[[, 100, , 20%, -5, 30, error, 400, 100, -5, 100], 10%, 
300]> but was:<[[undefined, 100, foo, 20%, -5, 30.2, 400, abc, -5, 
100.2], 10%, 300]></p>
<PRE>
</PRE>
<h4>Test: HTMLIFrameElementTest.width_px [IE8]</h4>
<p>Type:org.junit.ComparisonFailure</p>
<p>Message:expected:<[128[]]> but was:<[128[px]]></p>
<PRE>
</PRE>
<h4>Test: XMLDocumentTest.test [FF3.6]</h4>
<p>Type:org.junit.ComparisonFailure</p>
<p>Message:expected:<[[[object XMLDocument], OK]]> but 
was:<[[]]></p>
<PRE>
</PRE>
<h4>Test: XMLDocumentTest.test [IE6]</h4>
<p>Type:org.junit.ComparisonFailure</p>
<p>Message:expected:<[[[object XMLDocument]]]> but was:<[[]]></p>
<PRE>
</PRE>
<h4>Test: XMLDocumentTest.test [IE7]</h4>
<p>Type:org.junit.ComparisonFailure</p>
<p>Message:expected:<[[[object XMLDocument]]]> but was:<[[]]></p>
<PRE>
</PRE>
<h4>Test: XMLDocumentTest.test [IE8]</h4>
<p>Type:org.junit.ComparisonFailure</p>
<p>Message:expected:<[[[object XMLDocument]]]> but was:<[[]]></p>
<PRE>
</PRE>
<h4>Test: dojo</h4>
<p>Type:org.junit.ComparisonFailure</p>
<p>Message:expected:<[57 tests to run in 1 groups]> but was:<[Error: 
test timeout in ../../dojo/tests/_base/html.html]></p>
<PRE>
</PRE>
<h4>Test: GWT20Test.dynaTable [IE6]</h4>
<p>Type:java.lang.AssertionError</p>
<p>Message:expected:<3> but was:<0></p>
<PRE>
</PRE>
<h4>Test: GWT20Test.dynaTable [IE7]</h4>
<p>Type:java.lang.AssertionError</p>
<p>Message:expected:<3> but was:<0></p>
<PRE>
</PRE>
<h4>Test: GWT20Test.dynaTable [IE8]</h4>
<p>Type:java.lang.AssertionError</p>
<p>Message:expected:<3> but was:<0></p>
<PRE>
</PRE>
<h4>Test: JQuery126LocalTest.test [FF3.6]</h4>
<p>Type:java.lang.AssertionError</p>
<p>Message:2 failures:  expected:<...y<Element>|jQuery) ([0, 21], 
21)> but was:<...y<Element>|jQuery) ([1, 20], 21)> 
expected:<...module: contents() ([0, 12, 12])> but was:<...module: 
contents() ([2, 1, 3])></p>
<PRE>
</PRE>
<h4>Test: JQuery126LocalTest.test [IE6]</h4>
<p>Type:java.lang.AssertionError</p>
<p>Message:2 failures:  expected:<...y<Element>|jQuery) ([0, 21], 
21)> but was:<...y<Element>|jQuery) ([1, 20], 21)> 
expected:<...module: contents() ([0, 12, 12])> but was:<...module: 
contents() ([2, 1, 3])></p>
<PRE>
</PRE>
<h4>Test: JQuery126LocalTest.test [IE7]</h4>
<p>Type:java.lang.AssertionError</p>
<p>Message:2 failures:  expected:<...y<Element>|jQuery) ([0, 21], 
21)> but was:<...y<Element>|jQuery) ([1, 20], 21)> 
expected:<...module: contents() ([0, 12, 12])> but was:<...module: 
contents() ([2, 1, 3])></p>
<PRE>
</PRE>
<h4>Test: JQuery126Test.test [FF3.6]</h4>
<p>Type:java.lang.AssertionError</p>
<p>Message:2 failures:  expected:<...y<Element>|jQuery) ([0, 21], 
21)> but was:<...y<Element>|jQuery) ([1, 20], 21)> 
expected:<...module: contents() ([0, 12, 12])> but was:<...module: 
contents() ([2, 1, 3])></p>
<PRE>
</PRE>
<h4>Test: JQuery126Test.test [IE6]</h4>
<p>Type:java.lang.AssertionError</p>
<p>Message:2 failures:  expected:<...y<Element>|jQuery) ([0, 21], 
21)> but was:<...y<Element>|jQuery) ([1, 20], 21)> 
expected:<...module: contents() ([0, 12, 12])> but was:<...module: 
contents() ([2, 1, 3])></p>
<PRE>
</PRE>
<h4>Test: JQuery126Test.test [IE7]</h4>
<p>Type:java.lang.AssertionError</p>
<p>Message:2 failures:  expected:<...y<Element>|jQuery) ([0, 21], 
21)> but was:<...y<Element>|jQuery) ([1, 20], 21)> 
expected:<...module: contents() ([0, 12, 12])> but was:<...module: 
contents() ([2, 1, 3])></p>
<PRE>
</PRE>
<h4>Test: JQuery173GitTest.test_15 [FF3.6]</h4>
<p>Type:java.lang.AssertionError</p>
<p>Message:expected:<core: isWindow ([0, 14], 14)> but was:<core: 
isWindow ([1, 13], 14)></p>
<PRE>
</PRE>
<h4>Test: JQuery173GitTest.test_15 [IE6]</h4>
<p>Type:java.lang.AssertionError</p>
<p>Message:expected:<core: isWindow ([0, 14], 14)> but was:<core: 
isWindow ([1, 13], 14)></p>
<PRE>
</PRE>
<h4>Test: JQuery173GitTest.test_15 [IE7]</h4>
<p>Type:java.lang.AssertionError</p>
<p>Message:expected:<core: isWindow ([0, 14], 14)> but was:<core: 
isWindow ([1, 13], 14)></p>
<PRE>
</PRE>
<h4>Test: JQuery173GitTest.test_15 [IE8]</h4>
<p>Type:java.lang.AssertionError</p>
<p>Message:expected:<core: isWindow ([0, 14], 14)> but was:<core: 
isWindow ([1, 13], 14)></p>
<PRE>
</PRE>
<h4>Test: MooTools121Test.mooTools [FF3.6]</h4>
<p>Type:junit.framework.AssertionFailedError</p>
<p>Message:<li id="spec_36_list" class="exception">   <h3>     
<a href="#spec_36">       IFrame constructor     </a>      [     
<a href="?rerun=IFrame%20constructor">       rerun     </a>     ]   
</h3> </li>   <li id="spec_36" class="exception">   
<h3>     IFrame constructor [     <a 
href="?rerun=IFrame%20constructor">       rerun     </a>     ]   
</h3>   <ul id="spec_36_examples" class="examples">     <li 
id="example_235" class="success">       <h4>         should return a 
new IFrame       </h4>       <pre class="examples-code">         
<code>           function () {     var iFrame1 = 
document.createElement("iframe");     var iFrame2 = new IFrame();     
value_of(iFrame1.tagName).should_be(iFrame2.tagName); }         </code>   
    </pre>     </li>     <li id="example_236" 
class="exception">       <h4>         should return the same IFrame if 
passed       </h4>       <pre class="examples-code">         
<code>           function () {     var iFrame1 = 
document.createElement("iframe");     var iFrame2 = new IFrame(iFrame1);     
value_of(iFrame1).should_be(iFrame2); }         </code>       
</pre>       <div>         Cannot read property "document" from 
undefined         <p>           <br/>            at 
file:/raid/volume1/opt/htmlunit/cruisecontrol/checkout/target/test-classes/libraries/mootools/1.2.1/Source/Element/Element.js?1348055625380,
 line 66         </p>       </div>     </li>   </ul> 
</li>   </p>
<PRE>
</PRE>
<h4>Test: MooTools121Test.mooTools [IE6]</h4>
<p>Type:junit.framework.AssertionFailedError</p>
<p>Message:<li id="spec_36_list" class="exception">   <h3>     
<a href="#spec_36">       IFrame constructor     </a>      [     
<a href="?rerun=IFrame%20constructor">       rerun     </a>     ]   
</h3> </li>   <li id="spec_36" class="exception">   
<h3>     IFrame constructor [     <a 
href="?rerun=IFrame%20constructor">       rerun     </a>     ]   
</h3>   <ul id="spec_36_examples" class="examples">     <li 
id="example_235" class="success">       <h4>         should return a 
new IFrame       </h4>       <pre class="examples-code">         
<code>           function () {     var iFrame1 = 
document.createElement("iframe");     var iFrame2 = new IFrame();     
value_of(iFrame1.tagName).should_be(iFrame2.tagName); }         </code>   
    </pre>     </li>     <li id="example_236" 
class="exception">       <h4>         should return the same IFrame if 
passed       </h4>       <pre class="examples-code">         
<code>           function () {     var iFrame1 = 
document.createElement("iframe");     var iFrame2 = new IFrame(iFrame1);     
value_of(iFrame1).should_be(iFrame2); }         </code>       
</pre>       <div>         Cannot read property "document" from 
undefined         <p>           <br/>            at 
file:/raid/volume1/opt/htmlunit/cruisecontrol/checkout/target/test-classes/libraries/mootools/1.2.1/Source/Element/Element.js?1348055737456,
 line 66         </p>       </div>     </li>   </ul> 
</li>   </p>
<PRE>
</PRE>
<h4>Test: MooTools121Test.mooTools [IE7]</h4>
<p>Type:junit.framework.AssertionFailedError</p>
<p>Message:<li id="spec_36_list" class="exception">   <h3>     
<a href="#spec_36">       IFrame constructor     </a>      [     
<a href="?rerun=IFrame%20constructor">       rerun     </a>     ]   
</h3> </li>   <li id="spec_36" class="exception">   
<h3>     IFrame constructor [     <a 
href="?rerun=IFrame%20constructor">       rerun     </a>     ]   
</h3>   <ul id="spec_36_examples" class="examples">     <li 
id="example_235" class="success">       <h4>         should return a 
new IFrame       </h4>       <pre class="examples-code">         
<code>           function () {     var iFrame1 = 
document.createElement("iframe");     var iFrame2 = new IFrame();     
value_of(iFrame1.tagName).should_be(iFrame2.tagName); }         </code>   
    </pre>     </li>     <li id="example_236" 
class="exception">       <h4>         should return the same IFrame if 
passed       </h4>       <pre class="examples-code">         
<code>           function () {     var iFrame1 = 
document.createElement("iframe");     var iFrame2 = new IFrame(iFrame1);     
value_of(iFrame1).should_be(iFrame2); }         </code>       
</pre>       <div>         Cannot read property "document" from 
undefined         <p>           <br/>            at 
file:/raid/volume1/opt/htmlunit/cruisecontrol/checkout/target/test-classes/libraries/mootools/1.2.1/Source/Element/Element.js?1348055855587,
 line 66         </p>       </div>     </li>   </ul> 
</li>   </p>
<PRE>
</PRE>
<h4>Test: MooTools121Test.mooTools [IE8]</h4>
<p>Type:junit.framework.AssertionFailedError</p>
<p>Message:<li id="spec_36_list" class="exception">   <h3>     
<a href="#spec_36">       IFrame constructor     </a>      [     
<a href="?rerun=IFrame%20constructor">       rerun     </a>     ]   
</h3> </li>   <li id="spec_36" class="exception">   
<h3>     IFrame constructor [     <a 
href="?rerun=IFrame%20constructor">       rerun     </a>     ]   
</h3>   <ul id="spec_36_examples" class="examples">     <li 
id="example_235" class="success">       <h4>         should return a 
new IFrame       </h4>       <pre class="examples-code">         
<code>           function () {     var iFrame1 = 
document.createElement("iframe");     var iFrame2 = new IFrame();     
value_of(iFrame1.tagName).should_be(iFrame2.tagName); }         </code>   
    </pre>     </li>     <li id="example_236" 
class="exception">       <h4>         should return the same IFrame if 
passed       </h4>       <pre class="examples-code">         
<code>           function () {     var iFrame1 = 
document.createElement("iframe");     var iFrame2 = new IFrame(iFrame1);     
value_of(iFrame1).should_be(iFrame2); }         </code>       
</pre>       <div>         Cannot read property "document" from 
undefined         <p>           <br/>            at 
file:/raid/volume1/opt/htmlunit/cruisecontrol/checkout/target/test-classes/libraries/mootools/1.2.1/Source/Element/Element.js?1348055981245,
 line 66         </p>       </div>     </li>   </ul> 
</li>   </p>
<PRE>
</PRE>
<h4>Test: Prototype161Test.string [IE8]</h4>
<p>Type:org.junit.ComparisonFailure</p>
<p>Message:expected:<[41 tests, 247 assertions, 0 failures, 0 errors Status 
Test Message testInterpret passed 9 assertions, 0 failures, 0 errors 
testGsubWithReplacementFunction passed 3 assertions, 0 failures, 0 errors 
testGsubWithReplacementString passed 6 assertions, 0 failures, 0 errors 
testGsubWithReplacementTemplateString passed 4 assertions, 0 failures, 0 errors 
testGsubWithTroublesomeCharacters passed 9 assertions, 0 failures, 0 errors 
testSubWithReplacementFunction passed 4 assertions, 0 failures, 0 errors 
testSubWithReplacementString passed 4 assertions, 0 failures, 0 errors testScan 
passed 3 assertions, 0 failures, 0 errors testToArray passed 4 assertions, 0 
failures, 0 errors testCamelize passed 11 assertions, 0 failures, 0 errors 
testCapitalize passed 7 assertions, 0 failures, 0 errors testUnderscore passed 
8 assertions, 0 failures, 0 errors testDasherize passed 5 assertions, 0 
failures, 0 errors testTruncate passed 6 assertions, 0 failures, 0 errors 
testStrip passed 4 assertions, 0 failures, 0 errors testStripTags passed 6 
assertions, 0 failures, 0 errors testStripScripts passed 3 assertions, 0 
failures, 0 errors testExtractScripts passed 4 assertions, 0 failures, 0 errors 
testEvalScripts passed 3 assertions, 0 failures, 0 errors testEscapeHTML passed 
7 assertions, 0 failures, 0 errors Info: -- skipped for comparison -- 
testUnescapeHTML passed 8 assertions, 0 failures, 0 errors Info: -- skipped for 
comparison -- testTemplateEvaluation passed 2 assertions, 0 failures, 0 errors 
testTemplateEvaluationWithEmptyReplacement passed 3 assertions, 0 failures, 0 
errors testTemplateEvaluationWithFalses passed 1 assertions, 0 failures, 0 
errors testTemplateEvaluationWithNested passed 7 assertions, 0 failures, 0 
errors testTemplateEvaluationWithIndexing passed 9 assertions, 0 failures, 0 
errors testTemplateToTemplateReplacements passed 3 assertions, 0 failures, 0 
errors testTemplateEvaluationCombined passed 1 assertions, 0 failures, 0 errors 
testInterpolate passed 2 assertions, 0 failures, 0 errors testToQueryParams 
passed 15 assertions, 0 failures, 0 errors testInspect passed 8 assertions, 0 
failures, 0 errors testInclude passed 6 assertions, 0 failures, 0 errors 
testStartsWith passed 5 assertions, 0 failures, 0 errors testEndsWith passed 6 
assertions, 0 failures, 0 errors testBlank passed 5 assertions, 0 failures, 0 
errors testEmpty passed 5 assertions, 0 failures, 0 errors testSucc passed 6 
assertions, 0 failures, 0 errors testTimes passed 9 assertions, 0 failures, 0 
errors testToJSON passed 2 assertions, 0 failures, 0 errors testIsJSON passed 
15 assertions, 0 failures, 0 errors testEvalJSON passed 19 assertions, 0 
failures, 0 errors]> but was:<[running... Status Test Message 
testInterpret passed 9 assertions, 0 failures, 0 errors 
testGsubWithReplacementFunction passed 3 assertions, 0 failures, 0 errors 
testGsubWithReplacementString passed 6 assertions, 0 failures, 0 errors 
testGsubWithReplacementTemplateString passed 4 assertions, 0 failures, 0 errors 
testGsubWithTroublesomeCharacters passed 9 assertions, 0 failures, 0 errors 
testSubWithReplacementFunction passed 4 assertions, 0 failures, 0 errors 
testSubWithReplacementString passed 4 assertions, 0 failures, 0 errors testScan 
passed 3 assertions, 0 failures, 0 errors testToArray passed 4 assertions, 0 
failures, 0 errors testCamelize passed 11 assertions, 0 failures, 0 errors 
testCapitalize passed 7 assertions, 0 failures, 0 errors testUnderscore passed 
8 assertions, 0 failures, 0 errors testDasherize passed 5 assertions, 0 
failures, 0 errors testTruncate passed 6 assertions, 0 failures, 0 errors 
testStrip passed 4 assertions, 0 failures, 0 errors testStripTags passed 6 
assertions, 0 failures, 0 errors testStripScripts passed 3 assertions, 0 
failures, 0 errors testExtractScripts passed 4 assertions, 0 failures, 0 errors 
testEvalScripts passed 3 assertions, 0 failures, 0 errors testEscapeHTML  
]></p>
<PRE>
</PRE>
<h2>Functional Tests</h2>
<p>Szenarios: <b>0</b>, passed: <b>0</b>, failed: <b>0</b>, including <b>0</b> 
single steps.</p>
<table cellpadding="0" cellspacing="0" bgcolor="white" id="ftests">
<tr>
<td> </td>
</tr>
</table>
<h2>Modifications</h2>
<p>141 modifications since last build.</p>
<h3>asashour: More annotations (09/19/2012 10:25:18)</h3>
<ul>
<li class="oddrow">
<span class="modifificationType">></span>
                 
/trunk/htmlunit/src/main/java/com/gargoylesoftware/htmlunit/javascript/host/svg/SVGFEConvolveMatrixElement.java</li>
<li class="evenrow">
<span class="modifificationType">></span>
                 
/trunk/htmlunit/src/main/java/com/gargoylesoftware/htmlunit/javascript/host/svg/SVGMaskElement.java</li>
<li class="oddrow">
<span class="modifificationType">></span>
                 
/trunk/htmlunit/src/main/java/com/gargoylesoftware/htmlunit/javascript/host/svg/SVGPolylineElement.java</li>
<li class="evenrow">
<span class="modifificationType">></span>
                 
/trunk/htmlunit/src/main/java/com/gargoylesoftware/htmlunit/javascript/host/svg/SVGFEPointLightElement.java</li>
<li class="oddrow">
<span class="modifificationType">></span>
                 
/trunk/htmlunit/src/main/java/com/gargoylesoftware/htmlunit/javascript/host/svg/SVGUseElement.java</li>
<li class="evenrow">
<span class="modifificationType">></span>
                 
/trunk/htmlunit/src/main/java/com/gargoylesoftware/htmlunit/javascript/host/svg/SVGEllipseElement.java</li>
<li class="oddrow">
<span class="modifificationType">></span>
                 
/trunk/htmlunit/src/main/java/com/gargoylesoftware/htmlunit/javascript/host/SimpleArray.java</li>
<li class="evenrow">
<span class="modifificationType">></span>
                 
/trunk/htmlunit/src/main/java/com/gargoylesoftware/htmlunit/javascript/host/svg/SVGStyleElement.java</li>
<li class="oddrow">
<span class="modifificationType">></span>
                 
/trunk/htmlunit/src/main/java/com/gargoylesoftware/htmlunit/javascript/host/svg/SVGSwitchElement.java</li>
<li class="evenrow">
<span class="modifificationType">></span>
                 
/trunk/htmlunit/src/main/java/com/gargoylesoftware/htmlunit/javascript/host/svg/SVGAnimateMotionElement.java</li>
<li class="oddrow">
<span class="modifificationType">></span>
                 
/trunk/htmlunit/src/main/java/com/gargoylesoftware/htmlunit/javascript/host/svg/SVGClipPathElement.java</li>
<li class="evenrow">
<span class="modifificationType">></span>
                 
/trunk/htmlunit/src/main/java/com/gargoylesoftware/htmlunit/javascript/host/svg/SVGSymbolElement.java</li>
<li class="oddrow">
<span class="modifificationType">></span>
                 
/trunk/htmlunit/src/main/resources/com/gargoylesoftware/htmlunit/javascript/configuration/JavaScriptConfiguration.xml</li>
<li class="evenrow">
<span class="modifificationType">></span>
                 
/trunk/htmlunit/src/main/java/com/gargoylesoftware/htmlunit/javascript/host/svg/SVGFETileElement.java</li>
<li class="oddrow">
<span class="modifificationType">></span>
                 
/trunk/htmlunit/src/main/java/com/gargoylesoftware/htmlunit/javascript/host/DocumentFragment.java</li>
<li class="evenrow">
<span class="modifificationType">></span>
                 
/trunk/htmlunit/src/main/java/com/gargoylesoftware/htmlunit/javascript/host/svg/SVGFEMergeElement.java</li>
<li class="oddrow">
<span class="modifificationType">></span>
                 
/trunk/htmlunit/src/main/java/com/gargoylesoftware/htmlunit/javascript/host/svg/SVGAnimateElement.java</li>
<li class="evenrow">
<span class="modifificationType">></span>
                 
/trunk/htmlunit/src/main/java/com/gargoylesoftware/htmlunit/javascript/host/svg/SVGFEColorMatrixElement.java</li>
<li class="oddrow">
<span class="modifificationType">></span>
                 
/trunk/htmlunit/src/main/java/com/gargoylesoftware/htmlunit/javascript/host/svg/SVGDescElement.java</li>
<li class="evenrow">
<span class="modifificationType">></span>
                 
/trunk/htmlunit/src/main/java/com/gargoylesoftware/htmlunit/javascript/host/svg/SVGFESpecularLightingElement.java</li>
<li class="oddrow">
<span class="modifificationType">></span>
                 
/trunk/htmlunit/src/main/java/com/gargoylesoftware/htmlunit/javascript/host/svg/SVGFEMergeNodeElement.java</li>
<li class="evenrow">
<span class="modifificationType">></span>
                 
/trunk/htmlunit/src/main/java/com/gargoylesoftware/htmlunit/javascript/host/svg/SVGMarkerElement.java</li>
<li class="oddrow">
<span class="modifificationType">></span>
                 
/trunk/htmlunit/src/main/java/com/gargoylesoftware/htmlunit/javascript/host/svg/SVGTitleElement.java</li>
<li class="evenrow">
<span class="modifificationType">></span>
                 
/trunk/htmlunit/src/main/java/com/gargoylesoftware/htmlunit/javascript/host/svg/SVGImageElement.java</li>
<li class="oddrow">
<span class="modifificationType">></span>
                 
/trunk/htmlunit/src/main/java/com/gargoylesoftware/htmlunit/javascript/host/DOMTokenList.java</li>
<li class="evenrow">
<span class="modifificationType">></span>
                 
/trunk/htmlunit/src/main/java/com/gargoylesoftware/htmlunit/javascript/host/svg/SVGStopElement.java</li>
<li class="oddrow">
<span class="modifificationType">></span>
                 
/trunk/htmlunit/src/main/java/com/gargoylesoftware/htmlunit/javascript/host/EventNode.java</li>
<li class="evenrow">
<span class="modifificationType">></span>
                 
/trunk/htmlunit/src/main/java/com/gargoylesoftware/htmlunit/javascript/host/svg/SVGSVGElement.java</li>
<li class="oddrow">
<span class="modifificationType">></span>
                 
/trunk/htmlunit/src/main/java/com/gargoylesoftware/htmlunit/javascript/host/svg/SVGTextPathElement.java</li>
<li class="evenrow">
<span class="modifificationType">></span>
                 
/trunk/htmlunit/src/main/java/com/gargoylesoftware/htmlunit/javascript/host/svg/SVGCircleElement.java</li>
<li class="oddrow">
<span class="modifificationType">></span>
                 
/trunk/htmlunit/src/main/java/com/gargoylesoftware/htmlunit/javascript/host/svg/SVGFEDistantLightElement.java</li>
<li class="evenrow">
<span class="modifificationType">></span>
                 
/trunk/htmlunit/src/main/java/com/gargoylesoftware/htmlunit/javascript/host/svg/SVGRadialGradientElement.java</li>
<li class="oddrow">
<span class="modifificationType">></span>
                 
/trunk/htmlunit/src/main/java/com/gargoylesoftware/htmlunit/javascript/host/svg/SVGFEMorphologyElement.java</li>
<li class="evenrow">
<span class="modifificationType">></span>
                 
/trunk/htmlunit/src/main/java/com/gargoylesoftware/htmlunit/javascript/host/svg/SVGPatternElement.java</li>
<li class="oddrow">
<span class="modifificationType">></span>
                 
/trunk/htmlunit/src/main/java/com/gargoylesoftware/htmlunit/javascript/host/FormField.java</li>
<li class="evenrow">
<span class="modifificationType">></span>
                 
/trunk/htmlunit/src/main/java/com/gargoylesoftware/htmlunit/javascript/host/svg/SVGFETurbulenceElement.java</li>
<li class="oddrow">
<span class="modifificationType">></span>
                 
/trunk/htmlunit/src/main/java/com/gargoylesoftware/htmlunit/javascript/host/svg/SVGAltGlyphElement.java</li>
<li class="evenrow">
<span class="modifificationType">></span>
                 
/trunk/htmlunit/src/main/java/com/gargoylesoftware/htmlunit/javascript/host/svg/SVGFilterElement.java</li>
<li class="oddrow">
<span class="modifificationType">></span>
                 
/trunk/htmlunit/src/main/java/com/gargoylesoftware/htmlunit/javascript/host/svg/SVGFEDiffuseLightingElement.java</li>
<li class="evenrow">
<span class="modifificationType">></span>
                 
/trunk/htmlunit/src/main/java/com/gargoylesoftware/htmlunit/javascript/host/DocumentType.java</li>
<li class="oddrow">
<span class="modifificationType">></span>
                 
/trunk/htmlunit/src/main/java/com/gargoylesoftware/htmlunit/javascript/host/svg/SVGLinearGradientElement.java</li>
<li class="evenrow">
<span class="modifificationType">></span>
                 
/trunk/htmlunit/src/main/java/com/gargoylesoftware/htmlunit/javascript/host/Enumerator.java</li>
<li class="oddrow">
<span class="modifificationType">></span>
                 
/trunk/htmlunit/src/main/java/com/gargoylesoftware/htmlunit/javascript/host/svg/SVGSetElement.java</li>
<li class="evenrow">
<span class="modifificationType">></span>
                 
/trunk/htmlunit/src/main/java/com/gargoylesoftware/htmlunit/javascript/host/svg/SVGPathElement.java</li>
<li class="oddrow">
<span class="modifificationType">></span>
                 
/trunk/htmlunit/src/main/java/com/gargoylesoftware/htmlunit/javascript/host/svg/SVGFEImageElement.java</li>
<li class="evenrow">
<span class="modifificationType">></span>
                 
/trunk/htmlunit/src/main/java/com/gargoylesoftware/htmlunit/javascript/host/svg/SVGFEBlendElement.java</li>
<li class="oddrow">
<span class="modifificationType">></span>
                 
/trunk/htmlunit/src/main/java/com/gargoylesoftware/htmlunit/javascript/host/Element.java</li>
<li class="evenrow">
<span class="modifificationType">></span>
                 
/trunk/htmlunit/src/main/java/com/gargoylesoftware/htmlunit/javascript/host/DOMParser.java</li>
<li class="oddrow">
<span class="modifificationType">></span>
                 
/trunk/htmlunit/src/main/java/com/gargoylesoftware/htmlunit/javascript/host/svg/SVGScriptElement.java</li>
<li class="evenrow">
<span class="modifificationType">></span>
                 
/trunk/htmlunit/src/main/java/com/gargoylesoftware/htmlunit/javascript/host/DOMException.java</li>
<li class="oddrow">
<span class="modifificationType">></span>
                 
/trunk/htmlunit/src/main/java/com/gargoylesoftware/htmlunit/javascript/host/svg/SVGFECompositeElement.java</li>
<li class="evenrow">
<span class="modifificationType">></span>
                 
/trunk/htmlunit/src/main/java/com/gargoylesoftware/htmlunit/javascript/host/FormChild.java</li>
<li class="oddrow">
<span class="modifificationType">></span>
                 
/trunk/htmlunit/src/main/java/com/gargoylesoftware/htmlunit/javascript/host/svg/SVGFEComponentTransferElement.java</li>
<li class="evenrow">
<span class="modifificationType">></span>
                 
/trunk/htmlunit/src/main/java/com/gargoylesoftware/htmlunit/javascript/host/svg/SVGTextElement.java</li>
<li class="oddrow">
<span class="modifificationType">></span>
                 
/trunk/htmlunit/src/main/java/com/gargoylesoftware/htmlunit/javascript/host/html/HTMLListElement.java</li>
<li class="evenrow">
<span class="modifificationType">></span>
                 
/trunk/htmlunit/src/main/java/com/gargoylesoftware/htmlunit/javascript/host/svg/SVGTSpanElement.java</li>
<li class="oddrow">
<span class="modifificationType">></span>
                 
/trunk/htmlunit/src/main/java/com/gargoylesoftware/htmlunit/javascript/host/svg/SVGFESpotLightElement.java</li>
<li class="evenrow">
<span class="modifificationType">></span>
                 
/trunk/htmlunit/src/main/java/com/gargoylesoftware/htmlunit/javascript/host/Event.java</li>
<li class="oddrow">
<span class="modifificationType">></span>
                 
/trunk/htmlunit/src/main/java/com/gargoylesoftware/htmlunit/javascript/host/DOMImplementation.java</li>
<li class="evenrow">
<span class="modifificationType">></span>
                 
/trunk/htmlunit/src/main/java/com/gargoylesoftware/htmlunit/javascript/host/svg/SVGRectElement.java</li>
<li class="oddrow">
<span class="modifificationType">></span>
                 
/trunk/htmlunit/src/main/java/com/gargoylesoftware/htmlunit/javascript/host/svg/SVGFEOffsetElement.java</li>
<li class="evenrow">
<span class="modifificationType">></span>
                 
/trunk/htmlunit/src/main/java/com/gargoylesoftware/htmlunit/javascript/host/svg/SVGFEFuncAElement.java</li>
<li class="oddrow">
<span class="modifificationType">></span>
                 
/trunk/htmlunit/src/main/java/com/gargoylesoftware/htmlunit/javascript/host/svg/SVGFEFuncBElement.java</li>
<li class="evenrow">
<span class="modifificationType">></span>
                 
/trunk/htmlunit/src/main/java/com/gargoylesoftware/htmlunit/javascript/host/svg/SVGMpathElement.java</li>
<li class="oddrow">
<span class="modifificationType">></span>
                 
/trunk/htmlunit/src/main/java/com/gargoylesoftware/htmlunit/javascript/host/html/HTMLTableComponent.java</li>
<li class="evenrow">
<span class="modifificationType">></span>
                 
/trunk/htmlunit/src/main/java/com/gargoylesoftware/htmlunit/javascript/host/svg/SVGFEGaussianBlurElement.java</li>
<li class="oddrow">
<span class="modifificationType">></span>
                 
/trunk/htmlunit/src/main/java/com/gargoylesoftware/htmlunit/javascript/host/svg/SVGAnimateTransformElement.java</li>
<li class="evenrow">
<span class="modifificationType">></span>
                 
/trunk/htmlunit/src/main/java/com/gargoylesoftware/htmlunit/javascript/host/svg/SVGFEFuncGElement.java</li>
<li class="oddrow">
<span class="modifificationType">></span>
                 
/trunk/htmlunit/src/main/java/com/gargoylesoftware/htmlunit/javascript/host/svg/SVGFEFloodElement.java</li>
<li class="evenrow">
<span class="modifificationType">></span>
                 
/trunk/htmlunit/src/main/java/com/gargoylesoftware/htmlunit/javascript/host/svg/SVGElement.java</li>
<li class="oddrow">
<span class="modifificationType">></span>
                 
/trunk/htmlunit/src/main/java/com/gargoylesoftware/htmlunit/javascript/host/svg/SVGAElement.java</li>
<li class="evenrow">
<span class="modifificationType">></span>
                 
/trunk/htmlunit/src/main/java/com/gargoylesoftware/htmlunit/javascript/host/svg/SVGForeignObjectElement.java</li>
<li class="oddrow">
<span class="modifificationType">></span>
                 
/trunk/htmlunit/src/main/java/com/gargoylesoftware/htmlunit/javascript/host/svg/SVGMetadataElement.java</li>
<li class="evenrow">
<span class="modifificationType">></span>
                 
/trunk/htmlunit/src/main/java/com/gargoylesoftware/htmlunit/javascript/host/svg/SVGFEDisplacementMapElement.java</li>
<li class="oddrow">
<span class="modifificationType">></span>
                 
/trunk/htmlunit/src/main/java/com/gargoylesoftware/htmlunit/javascript/host/svg/SVGDefsElement.java</li>
<li class="evenrow">
<span class="modifificationType">></span>
                 
/trunk/htmlunit/src/main/java/com/gargoylesoftware/htmlunit/javascript/host/svg/SVGGElement.java</li>
<li class="oddrow">
<span class="modifificationType">></span>
                 
/trunk/htmlunit/src/main/java/com/gargoylesoftware/htmlunit/javascript/host/svg/SVGLineElement.java</li>
<li class="evenrow">
<span class="modifificationType">></span>
                 
/trunk/htmlunit/src/main/java/com/gargoylesoftware/htmlunit/javascript/host/svg/SVGPolygonElement.java</li>
<li class="oddrow">
<span class="modifificationType">></span>
                 
/trunk/htmlunit/src/main/java/com/gargoylesoftware/htmlunit/javascript/host/svg/SVGFEFuncRElement.java</li>
<li class="evenrow">
<span class="modifificationType">></span>
                 
/trunk/htmlunit/src/main/java/com/gargoylesoftware/htmlunit/javascript/host/Node.java</li>
<li class="oddrow">
<span class="modifificationType">></span>
                 
/trunk/htmlunit/src/main/java/com/gargoylesoftware/htmlunit/javascript/host/html/HTMLImageElement.java</li>
<li class="evenrow">
<span class="modifificationType">></span>
                 
/trunk/htmlunit/src/main/java/com/gargoylesoftware/htmlunit/javascript/host/html/HTMLAppletElement.java</li>
<li class="oddrow">
<span class="modifificationType">></span>
                 
/trunk/htmlunit/src/main/java/com/gargoylesoftware/htmlunit/javascript/host/StaticNodeList.java</li>
<li class="evenrow">
<span class="modifificationType">></span>
                 
/trunk/htmlunit/src/main/java/com/gargoylesoftware/htmlunit/javascript/host/html/HTMLMetaElement.java</li>
<li class="oddrow">
<span class="modifificationType">></span>
                 
/trunk/htmlunit/src/main/java/com/gargoylesoftware/htmlunit/javascript/host/NodeFilter.java</li>
<li class="evenrow">
<span class="modifificationType">></span>
                 
/trunk/htmlunit/src/main/java/com/gargoylesoftware/htmlunit/javascript/host/html/HTMLInsElement.java</li>
<li class="oddrow">
<span class="modifificationType">></span>
                 
/trunk/htmlunit/src/main/resources/com/gargoylesoftware/htmlunit/javascript/configuration/JavaScriptConfiguration.xml</li>
<li class="evenrow">
<span class="modifificationType">></span>
                 
/trunk/htmlunit/src/main/java/com/gargoylesoftware/htmlunit/javascript/host/html/HTMLLegendElement.java</li>
<li class="oddrow">
<span class="modifificationType">></span>
                 
/trunk/htmlunit/src/main/java/com/gargoylesoftware/htmlunit/javascript/host/html/HTMLInputElement.java</li>
<li class="evenrow">
<span class="modifificationType">></span>
                 
/trunk/htmlunit/src/main/java/com/gargoylesoftware/htmlunit/javascript/host/html/HTMLAudioElement.java</li>
<li class="oddrow">
<span class="modifificationType">></span>
                 
/trunk/htmlunit/src/main/java/com/gargoylesoftware/htmlunit/javascript/host/html/HTMLBaseFontElement.java</li>
<li class="evenrow">
<span class="modifificationType">></span>
                 
/trunk/htmlunit/src/main/java/com/gargoylesoftware/htmlunit/javascript/host/TreeWalker.java</li>
<li class="oddrow">
<span class="modifificationType">></span>
                 
/trunk/htmlunit/src/main/java/com/gargoylesoftware/htmlunit/javascript/host/html/HTMLIsIndexElement.java</li>
<li class="evenrow">
<span class="modifificationType">></span>
                 
/trunk/htmlunit/src/main/java/com/gargoylesoftware/htmlunit/javascript/host/html/HTMLIFrameElement.java</li>
<li class="oddrow">
<span class="modifificationType">></span>
                 
/trunk/htmlunit/src/main/java/com/gargoylesoftware/htmlunit/javascript/host/html/HTMLDelElement.java</li>
<li class="evenrow">
<span class="modifificationType">></span>
                 
/trunk/htmlunit/src/main/java/com/gargoylesoftware/htmlunit/javascript/host/html/HTMLDirectoryElement.java</li>
<li class="oddrow">
<span class="modifificationType">></span>
                 
/trunk/htmlunit/src/main/java/com/gargoylesoftware/htmlunit/javascript/host/html/HTMLDocument.java</li>
<li class="evenrow">
<span class="modifificationType">></span>
                 
/trunk/htmlunit/src/main/java/com/gargoylesoftware/htmlunit/javascript/host/html/HTMLHtmlElement.java</li>
<li class="oddrow">
<span class="modifificationType">></span>
                 
/trunk/htmlunit/src/main/java/com/gargoylesoftware/htmlunit/javascript/host/html/HTMLMenuElement.java</li>
<li class="evenrow">
<span class="modifificationType">></span>
                 
/trunk/htmlunit/src/main/java/com/gargoylesoftware/htmlunit/javascript/host/Location.java</li>
<li class="oddrow">
<span class="modifificationType">></span>
                 
/trunk/htmlunit/src/main/java/com/gargoylesoftware/htmlunit/javascript/host/html/HTMLFrameSetElement.java</li>
<li class="evenrow">
<span class="modifificationType">></span>
                 
/trunk/htmlunit/src/main/java/com/gargoylesoftware/htmlunit/javascript/host/html/HTMLAreaElement.java</li>
<li class="oddrow">
<span class="modifificationType">></span>
                 
/trunk/htmlunit/src/main/java/com/gargoylesoftware/htmlunit/javascript/host/geo/Geolocation.java</li>
<li class="evenrow">
<span class="modifificationType">></span>
                 
/trunk/htmlunit/src/main/java/com/gargoylesoftware/htmlunit/javascript/host/html/HTMLAnchorElement.java</li>
<li class="oddrow">
<span class="modifificationType">></span>
                 
/trunk/htmlunit/src/main/java/com/gargoylesoftware/htmlunit/javascript/host/geo/Position.java</li>
<li class="evenrow">
<span class="modifificationType">></span>
                 
/trunk/htmlunit/src/main/java/com/gargoylesoftware/htmlunit/javascript/host/Screen.java</li>
<li class="oddrow">
<span class="modifificationType">></span>
                 
/trunk/htmlunit/src/main/java/com/gargoylesoftware/htmlunit/javascript/host/html/HTMLMapElement.java</li>
<li class="evenrow">
<span class="modifificationType">></span>
                 
/trunk/htmlunit/src/main/java/com/gargoylesoftware/htmlunit/javascript/host/html/HTMLOptGroupElement.java</li>
<li class="oddrow">
<span class="modifificationType">></span>
                 
/trunk/htmlunit/src/main/java/com/gargoylesoftware/htmlunit/javascript/host/External.java</li>
<li class="evenrow">
<span class="modifificationType">></span>
                 
/trunk/htmlunit/src/main/java/com/gargoylesoftware/htmlunit/javascript/host/html/HTMLDListElement.java</li>
<li class="oddrow">
<span class="modifificationType">></span>
                 
/trunk/htmlunit/src/main/java/com/gargoylesoftware/htmlunit/javascript/host/html/HTMLCollection.java</li>
<li class="evenrow">
<span class="modifificationType">></span>
                 
/trunk/htmlunit/src/main/java/com/gargoylesoftware/htmlunit/javascript/host/Selection.java</li>
<li class="oddrow">
<span class="modifificationType">></span>
                 
/trunk/htmlunit/src/main/java/com/gargoylesoftware/htmlunit/javascript/host/html/HTMLDivElement.java</li>
<li class="evenrow">
<span class="modifificationType">></span>
                 
/trunk/htmlunit/src/main/java/com/gargoylesoftware/htmlunit/javascript/host/MessageEvent.java</li>
<li class="oddrow">
<span class="modifificationType">></span>
                 
/trunk/htmlunit/src/main/java/com/gargoylesoftware/htmlunit/javascript/host/Navigator.java</li>
<li class="evenrow">
<span class="modifificationType">></span>
                 
/trunk/htmlunit/src/main/java/com/gargoylesoftware/htmlunit/javascript/host/Range.java</li>
<li class="oddrow">
<span class="modifificationType">></span>
                 
/trunk/htmlunit/src/main/java/com/gargoylesoftware/htmlunit/javascript/host/html/HTMLFrameElement.java</li>
<li class="evenrow">
<span class="modifificationType">></span>
                 
/trunk/htmlunit/src/main/java/com/gargoylesoftware/htmlunit/javascript/host/html/HTMLOListElement.java</li>
<li class="oddrow">
<span class="modifificationType">></span>
                 
/trunk/htmlunit/src/main/java/com/gargoylesoftware/htmlunit/javascript/host/html/HTMLBodyElement.java</li>
<li class="evenrow">
<span class="modifificationType">></span>
                 
/trunk/htmlunit/src/main/java/com/gargoylesoftware/htmlunit/javascript/host/html/HTMLLinkElement.java</li>
<li class="oddrow">
<span class="modifificationType">></span>
                 
/trunk/htmlunit/src/main/java/com/gargoylesoftware/htmlunit/javascript/host/History.java</li>
<li class="evenrow">
<span class="modifificationType">></span>
                 
/trunk/htmlunit/src/main/java/com/gargoylesoftware/htmlunit/javascript/host/KeyboardEvent.java</li>
<li class="oddrow">
<span class="modifificationType">></span>
                 
/trunk/htmlunit/src/main/java/com/gargoylesoftware/htmlunit/javascript/host/html/HTMLFieldSetElement.java</li>
<li class="evenrow">
<span class="modifificationType">></span>
                 
/trunk/htmlunit/src/main/java/com/gargoylesoftware/htmlunit/javascript/host/html/HTMLHeadingElement.java</li>
<li class="oddrow">
<span class="modifificationType">></span>
                 
/trunk/htmlunit/src/main/java/com/gargoylesoftware/htmlunit/javascript/host/html/HTMLCollectionTags.java</li>
<li class="evenrow">
<span class="modifificationType">></span>
                 
/trunk/htmlunit/src/main/java/com/gargoylesoftware/htmlunit/javascript/host/Storage.java</li>
<li class="oddrow">
<span class="modifificationType">></span>
                 
/trunk/htmlunit/src/main/java/com/gargoylesoftware/htmlunit/javascript/host/html/HTMLHeadElement.java</li>
<li class="evenrow">
<span class="modifificationType">></span>
                 
/trunk/htmlunit/src/main/java/com/gargoylesoftware/htmlunit/javascript/host/html/HTMLBRElement.java</li>
<li class="oddrow">
<span class="modifificationType">></span>
                 
/trunk/htmlunit/src/main/java/com/gargoylesoftware/htmlunit/javascript/host/html/HTMLFormElement.java</li>
<li class="evenrow">
<span class="modifificationType">></span>
                 
/trunk/htmlunit/src/main/java/com/gargoylesoftware/htmlunit/javascript/host/html/HTMLLIElement.java</li>
<li class="oddrow">
<span class="modifificationType">></span>
                 
/trunk/htmlunit/src/main/java/com/gargoylesoftware/htmlunit/javascript/host/html/HTMLFontElement.java</li>
<li class="evenrow">
<span class="modifificationType">></span>
                 
/trunk/htmlunit/src/main/java/com/gargoylesoftware/htmlunit/javascript/host/html/HTMLObjectElement.java</li>
<li class="oddrow">
<span class="modifificationType">></span>
                 
/trunk/htmlunit/src/main/java/com/gargoylesoftware/htmlunit/javascript/host/MediaList.java</li>
<li class="evenrow">
<span class="modifificationType">></span>
                 
/trunk/htmlunit/src/main/java/com/gargoylesoftware/htmlunit/javascript/host/html/HTMLHRElement.java</li>
<li class="oddrow">
<span class="modifificationType">></span>
                 
/trunk/htmlunit/src/main/java/com/gargoylesoftware/htmlunit/javascript/host/html/HTMLBaseElement.java</li>
<li class="evenrow">
<span class="modifificationType">></span>
                 
/trunk/htmlunit/src/main/java/com/gargoylesoftware/htmlunit/javascript/host/css/StyleSheetList.java</li>
<li class="oddrow">
<span class="modifificationType">></span>
                 
/trunk/htmlunit/src/main/java/com/gargoylesoftware/htmlunit/javascript/host/html/HTMLCanvasElement.java</li>
<li class="evenrow">
<span class="modifificationType">></span>
                 
/trunk/htmlunit/src/main/java/com/gargoylesoftware/htmlunit/javascript/host/html/HTMLButtonElement.java</li>
<li class="oddrow">
<span class="modifificationType">></span>
                 
/trunk/htmlunit/src/main/java/com/gargoylesoftware/htmlunit/javascript/host/html/HTMLEmbedElement.java</li>
<li class="evenrow">
<span class="modifificationType">></span>
                 
/trunk/htmlunit/src/main/java/com/gargoylesoftware/htmlunit/javascript/host/NodeList.java</li>
<li class="oddrow">
<span class="modifificationType">></span>
                 
/trunk/htmlunit/src/main/java/com/gargoylesoftware/htmlunit/javascript/host/html/HTMLLabelElement.java</li>
</ul>
</body>
</html>
------------------------------------------------------------------------------
Live Security Virtual Conference
Exclusive live event will cover all the ways today's security and 
threat landscape has changed and how IT managers can respond. Discussions 
will include endpoint security, mobile security and the latest in malware 
threats. http://www.accelacomm.com/jaw/sfrnl04242012/114/50122263/
_______________________________________________
HtmlUnit-develop mailing list
[email protected]
https://lists.sourceforge.net/lists/listinfo/htmlunit-develop
msgmiddle
<Prev in Thread] Current Thread [Next in Thread>
  • [HtmlUnit] htmlunit Build Failed, (continued)
    • [HtmlUnit] htmlunit Build Failed
    • [HtmlUnit] htmlunit Build Failed
    • [HtmlUnit] htmlunit Build Failed
    • [HtmlUnit] htmlunit Build Failed
    • [HtmlUnit] htmlunit Build Failed
    • [HtmlUnit] htmlunit Build Failed
    • [HtmlUnit] htmlunit Build Failed
    • [HtmlUnit] htmlunit Build Failed
    • [HtmlUnit] htmlunit Build Failed
    • [HtmlUnit] htmlunit Build Failed
    • [HtmlUnit] htmlunit Build Failed,
    • [HtmlUnit] htmlunit Build Failed
    • [HtmlUnit] htmlunit Build Failed
    • [HtmlUnit] htmlunit Build Failed
    • [HtmlUnit] htmlunit Build Failed
    • [HtmlUnit] htmlunit Build Failed
      • [HtmlUnit] JavaScriptConfigurationTest.configurationMapExpands
    • [HtmlUnit] htmlunit Build Failed
    • [HtmlUnit] htmlunit Build Failed
    • [HtmlUnit] htmlunit Build Failed
    • [HtmlUnit] htmlunit Build Failed
Current Sitemap | © 2012 planetjava | Contact | Privacy Policy